{"text_format":"1","workbook":"xlsx","n_sheets":10,"sheets":["README","Advance_curve","LowRPM","EEPROM16","Accuracy","formules","Calculs","Dwell variable","Version","Excel"],"not_rendered":{"charts":6,"images":4,"macros":0,"external_links":0,"defined_names":2,"comments":4,"pivot_tables":0},"unopened":[],"bounds":{"document_bytes":16777216,"sheet_cells":100000,"rows_first":2000,"rows_last":500,"rows_between":2000,"halvings":0,"cell_chars":16384,"cell_head_chars":4096},"cells_cut":0,"cells_raw":0,"read":"whole","date_system":"1900"}

{"sheet":"README","index":0,"n_rows":19,"n_cols":8,"rows_kept":19,"cut":false,"hidden":false,"merged":[]}
[]
[null,"With the values your entered, the CDI behavior will be the following:"]
[]
[null,null,null,null,null,null,null,"Where to change that?"]
[]
[]
["A) ",{"$f":"CONCATENATE(\"Flat advance from \",LowRPM!L7,\" to \",Advance_curve!C7,\" RPM\")","v":"Flat advance from 76 to 673 RPM"},null,null,null,null,null,"cell I2 in tab \"lowRPM\""]
[]
["B)",{"$f":"CONCATENATE(\"Advance curve is freely adjustable from \",Advance_curve!C7,\" to \",Advance_curve!D9,\" RPM\")","v":"Advance curve is freely adjustable from 673 to 7812 RPM"},null,null,null,null,null,"cell B9 in tab \"Advance_curve\""]
[]
["C)",{"$f":"CONCATENATE(\"The \",Advance_curve!C7,\" RPM when the processor swap from [advance_curve] tab to the flat [advance_low_rpm] tab is adjustable by cell M42 in tab [Advance_curve]\")","v":"The 673 RPM when the processor swap from [advance_curve] tab to the flat [advance_low_rpm] tab is adjustable by cell M42 in tab [Advance_curve]"}]
[]
[null,"Eprom values to burn into the microcontroller",null,null,null,null,null,"cells O18 to 035 in tab \"Advance_curve\""]
[]
[null,{"$f":"CONCATENATE(\"No spark when engine goes above \",Advance_curve!D9,\"RPM - Act as absolute rev-limiter\")","v":"No spark when engine goes above 7812RPM - Act as absolute rev-limiter"},null,null,null,null,null,"cell B9 in tab \"Advance_curve\""]
[]
[null,"Optional rev-limiter activated by JP2 jumper",null,null,null,null,null,"cell M30 in tab \"Advance_curve\""]
[]
[null,"ONLY YELLOW CELLS ARE CHANGEABLE"]

{"sheet":"Advance_curve","index":1,"n_rows":335,"n_cols":25,"rows_kept":335,"cut":false,"hidden":false,"merged":[]}
["27/03/2021",null,null,"Version 16F1827 v7.9r25c1",null,null,null,null,null,null,79,25,1]
[null,"Proc:","16F1827"]
[null,"Clock:",16,"MHz",null,"1 i",null,null,null,null,"Step"]
[null,"Fosc/4",{"$f":"C3/4","v":4},"MHz",null,"pickup position",null,"compute (us)",{"$f":"O28","v":26},null,"(us)"]
[null,"TMR1h max",{"$f":"MAX(B173:B335)","v":174},null,null,75,"degrees BTDC",null,null,null,40,{"$f":"IF(MAX(K9:K103)>254,\"Some warning. Increase STEP cell k5 ?\",\"\")","v":""}]
[null,"Frq min",{"$f":"MIN(C174:C335)","v":11.2248563218391},null,null,null,null,"hysteresis",{"$f":"O42*200","v":200}]
[null,"RPM min",{"$f":"MIN(D175:D335)","v":673},null,null,"4 i",null,null,null,null,{"$f":"IF(ISERROR(K9),\"Load DECHEX macro\",\"\")","v":""}]
[null,"TIMER1H count","Frq\n(Hz)","RPM","time for 1° (µs)","Advance (degrees)","Delay\nneeded\n(ms)","Delay\nnedeed\n(µs)","Delay\nto wait\n(µs)","@\nmap","Values for\nthe map"]
["3 g",15,{"$f":"IFERROR(1000000/(B9*256*($N$30/$C$4)),\"\")","v":130.208333333333},{"$f":"INT(60*C9*$N$25/2*$N$24)","v":7812},{"$f":"((1000*1000*60)/($N$24*D9))/360","v":21.3346987540536},30,{"$f":"(E9*($F$5-F9))/1000","v":0.960061443932412},{"$f":"E9*($F$5-F9)","v":960.061443932412},{"$f":"IF($H9>$I$4+$I$6,INT($H9-$I$4-$I$6),\"out of range\")","v":734},0,{"$f":"IFERROR(IF($I9/$K$5>255,255,IF($I9>0.01,INT($I9/$K$5),1)),255)","v":18},{"$f":"IF($I9/$K$5>255,CONCATENATE(\"WARNING: Timing will be more then \",F9,\"°\"),\"\")","v":""},null,null,null,null,null,null,null,null,null,null,null,null,{"$f":"CONCATENATE(K9,\"         ;\",ROUND(D9,0),\"rpm | \",ROUND(F9,1),\"° | \",,ROUND(G9,2),\"ms \")","v":"18         ;7812rpm | 30° | 0.96ms "}]
[{"$f":"IF($B10>255,CONCATENATE(\"ERROR: Timer1H too large\"),\"\")","v":""},{"$f":"IF((B9+1)<(N$44+$B$9),B9+1,\"- End -\")","v":16},{"$f":"IFERROR(1000000/(B10*256*($N$30/$C$4)),\"\")","v":122.0703125},{"$f":"INT(60*C10*$N$25/2*$N$24)","v":7324},22.7562352084471,30,1.02403058438012,1024.03058438012,{"$f":"IF($H10>$I$4+$I$6,INT($H10-$I$4-$I$6),\"out of range\")","v":798},1,19,"",null,null,null,null,null,null,null,null,null,null,null,null,"19         ;7324rpm | 30° | 1.02ms "]
["",17,114.889705882353,{"$f":"INT(60*C11*$N$25/2*$N$24)","v":6893},24.1791189129068,30,1.08806035108081,1088.06035108081,{"$f":"IF($H11>$I$4+$I$6,INT($H11-$I$4-$I$6),\"out of range\")","v":862},2,21,"",null,null,null,null,null,null,null,null,null,null,null,null,"21         ;6893rpm | 30° | 1.09ms "]
["",18,108.506944444444,6510,25.6016385048643,30,1.15207373271889,1152.07373271889,926,3,23,"",null,null,null,null,null,null,null,null,null,null,null,null,"23         ;6510rpm | 30° | 1.15ms "]
["",19,102.796052631579,6167,27.0255661856116,30,1.21615047835252,1216.15047835252,990,4,24,"",null,null,null,null,null,null,null,null,null,null,null,null,"24         ;6167rpm | 30° | 1.22ms "]
["",20,97.65625,5859,28.4462650054048,30,1.28008192524322,1280.08192524322,1054,5,26,"",null,null,null,null,null,null,null,null,null,null,null,null,"26         ;5859rpm | 30° | 1.28ms "]
["",21,93.0059523809524,5580,29.868578255675,29.9,1.34707287933094,1347.07287933094,1121,6,28,"",null,null,null,null,null,null,null,null,null,null,null,null,"28         ;5580rpm | 29.9° | 1.35ms "]
["",22,88.7784090909091,5326,31.2930279133809,29.8,1.41444486168482,1414.44486168482,1188,7,29,"",null,null,null,null,null,null,null,null,null,null,null,null,"29         ;5326rpm | 29.8° | 1.41ms "]
["",23,84.9184782608696,5095,32.7118089630357,29.6,1.48511612692182,1485.11612692182,1259,8,31,"",null,null,"EEprom data ð",{"$f":"CONCATENATE(EEPROM16!O1,\" for PIC 16F1827\")","v":"INTEL 16HEX format for PIC 16F1827"},null,null,null,null,null,null,null,null,"31         ;5095rpm | 29.6° | 1.49ms "]
["",24,81.3802083333333,4882,34.1390140652738,29.5,1.55332513996996,1553.32513996996,1327,9,33,"",null,null,null,null,null,null,null,"MCH format",null,null,null,null,"33         ;4882rpm | 29.5° | 1.55ms "]
["",25,78.125,4687,35.5593485527345,29.3,1.62506222885997,1625.06222885997,1399,10,34,"",null,null,null,{"$f":"EEPROM16!O2","v":":020000040000FA"},null,{"$f":"EEPROM16!Q1","v":"RAW format"},null,null,null,null,null,null,"34         ;4687rpm | 29.3° | 1.63ms "]
["",26,75.1201923076923,4507,36.9795133496043,29.1,1.69735966274684,1697.35966274684,1471,11,36,"",null,null,null,{"$f":"EEPROM16!O3","v":":020000040001F9"},null,null,null,{"$f":"DEC2HEX(EEPROM16!F$4,2)","v":"12"},null,null,null,null,"36         ;4507rpm | 29.1° | 1.7ms "]
["",27,72.337962962963,4340,38.4024577572965,29,1.76651305683564,1766.51305683564,1540,12,38,"",null,null,null,{"$f":"EEPROM16!O4","v":":10E00000120013001500170018001A001C001D0054"},null,{"$f":"EEPROM16!Q4","v":"12 13 15 17   18 1A 1C 1D"},null,{"$f":"DEC2HEX(EEPROM16!G$4,2)","v":"13"},null,null,null,null,"38         ;4340rpm | 29° | 1.77ms "]
["",28,69.7544642857143,4185,39.8247710075667,28.8,1.83990442054958,1839.90442054958,1613,13,40,"",null,"2 i",null,{"$f":"EEPROM16!O5","v":":10E010001F00210022002400260028002A002C00D6"},null,{"$f":"EEPROM16!Q5","v":"1F 21 22 24   26 28 2A 2C"},null,{"$f":"DEC2HEX(EEPROM16!H$4,2)","v":"15"},null,null,null,null,"40         ;4185rpm | 28.8° | 1.84ms "]
["",29,67.3491379310345,4040,41.2541254125413,28.6,1.91419141914192,1914.19141914192,1688,14,42,"",null,null,null,{"$f":"EEPROM16!O6","v":":10E020002E0030003200340037003A003D0040003E"},null,{"$f":"EEPROM16!Q6","v":"2E 30 32 34   37 3A 3D 40"},null,{"$f":"DEC2HEX(EEPROM16!I$4,2)","v":"17"},null,null,null,null,"42         ;4040rpm | 28.6° | 1.91ms "]
["",30,65.1041666666667,3906,42.6693975081072,28.4,1.9883939238778,1988.3939238778,1762,15,44,"","Number of cylinder",1,null,{"$f":"EEPROM16!O7","v":":10E030004300460049004C004F0052005500580074"},null,{"$f":"EEPROM16!Q7","v":"43 46 49 4C   4F 52 55 58"},null,{"$f":"DEC2HEX(EEPROM16!J$4,2)","v":"18"},null,null,null,null,"44         ;3906rpm | 28.4° | 1.99ms "]
["",31,63.0040322580645,3780,44.0917107583774,28.1,2.0679012345679,2067.9012345679,1841,16,46,"",null,{"$f":"IF(N26=\"4 no wasted spark\",4,2)","v":2},null,{"$f":"EEPROM16!O8","v":":10E040005B005E006100640067006A006C006F00A6"},null,{"$f":"EEPROM16!Q8","v":"5B 5E 61 64   67 6A 6C 6F"},null,{"$f":"DEC2HEX(EEPROM16!K$4,2)","v":"1A"},null,null,null,null,"46         ;3780rpm | 28.1° | 2.07ms "]
["",32,61.03515625,3662,45.5124704168942,27.8,2.14818860367741,2148.18860367741,1922,17,48,"","Strokes",2,null,{"$f":"EEPROM16!O9","v":":10E050007200750077007A007D007F0082008500E5"},null,{"$f":"EEPROM16!Q9","v":"72 75 77 7A   7D 7F 82 85"},null,{"$f":"DEC2HEX(EEPROM16!L$4,2)","v":"1C"},null,null,null,null,"48         ;3662rpm | 27.8° | 2.15ms "]
["",33,59.1856060606061,3551,46.935135642542,27.3,2.23880597014925,2238.80597014925,2012,18,50,"",null,null,null,{"$f":"EEPROM16!O10","v":":10E0600087008A008D008F009200940097009A002C"},null,{"$f":"EEPROM16!Q10","v":"87 8A 8D 8F   92 94 97 9A"},null,{"$f":"DEC2HEX(EEPROM16!M$4,2)","v":"1D"},null,null,null,null,"50         ;3551rpm | 27.3° | 2.24ms "]
["",34,57.4448529411765,3446,48.3652544012382,26.6,2.34087831301993,2340.87831301993,2114,19,52,"","Ignition type","DCCDI",{"$f":"IF(N28=\"ACCDI\",42,26)","v":26},{"$f":"EEPROM16!O11","v":":10E070009C009F00A100A400A600A900AB00AE0078"},null,{"$f":"EEPROM16!Q11","v":"9C 9F A1 A4   A6 A9 AB AE"},null,{"$f":"DEC2HEX(EEPROM16!F$5,2)","v":"1F"},null,null,null,null,"52         ;3446rpm | 26.6° | 2.34ms "]
["",35,55.8035714285714,3348,49.7809637594584,25.9,2.44424532058941,2444.24532058941,2218,20,55,"",null,null,null,{"$f":"EEPROM16!O12","v":":10E08000B000B300B500B700BA00BC00BE00C100CC"},null,{"$f":"EEPROM16!Q12","v":"B0 B3 B5 B7   BA BC BE C1"},null,{"$f":"DEC2HEX(EEPROM16!G$5,2)","v":"21"},null,null,null,null,"55         ;3348rpm | 25.9° | 2.44ms "]
["",36,54.2534722222222,3255,51.2032770097286,25,2.56016385048643,2560.16385048643,2334,21,58,"","prescaler",8,null,{"$f":"EEPROM16!O13","v":":10E09000C300C500C800CA00CC00CF00D100D30027"},null,{"$f":"EEPROM16!Q13","v":"C3 C5 C8 CA   CC CF D1 D3"},null,{"$f":"DEC2HEX(EEPROM16!H$5,2)","v":"22"},null,null,null,null,"58         ;3255rpm | 25° | 2.56ms "]
["",37,52.7871621621622,3167,52.6260393642774,24,2.68392800757815,2683.92800757815,2457,22,61,"",null,null,null,{"$f":"EEPROM16!O14","v":":10E0A000550056005700580059005A005B005C00AC"},null,{"$f":"EEPROM16!Q14","v":"55 56 57 58   59 5A 5B 5C"},null,{"$f":"DEC2HEX(EEPROM16!I$5,2)","v":"24"},null,null,null,null,"61         ;3167rpm | 24° | 2.68ms "]
["",38,51.3980263157895,3083,54.0598983673911,23,2.81111471510434,2811.11471510434,2585,23,64,"","output width","Auto","us",{"$f":"EEPROM16!O15","v":":10E0B0005D005D005E005F00600061006200630063"},null,{"$f":"EEPROM16!Q15","v":"5D 5D 5E 5F   60 61 62 63"},null,{"$f":"DEC2HEX(EEPROM16!J$5,2)","v":"26"},null,null,null,null,"64         ;3083rpm | 23° | 2.81ms "]
["",39,50.0801282051282,3004,55.4815801154017,22,2.94052374611629,2940.52374611629,2714,24,67,"",null,null,null,{"$f":"EEPROM16!O16","v":":10E0C00064006500660067006800690069006A0016"},null,{"$f":"EEPROM16!Q16","v":"64 65 66 67   68 69 69 6A"},null,{"$f":"DEC2HEX(EEPROM16!K$5,2)","v":"28"},null,null,null,null,"67         ;3004rpm | 22° | 2.94ms "]
["",40,48.828125,2929,56.9022419483328,21.2,3.0613406168203,3061.3406168203,2835,25,70,"","Optional Rev Limit",3906,"RPM",{"$f":"EEPROM16!O17","v":":10E0D0006B006C006D006E006F00700071007200CC"},null,{"$f":"EEPROM16!Q17","v":"6B 6C 6D 6E   6F 70 71 72"},null,{"$f":"DEC2HEX(EEPROM16!L$5,2)","v":"2A"},null,null,null,null,"70         ;2929rpm | 21.2° | 3.06ms "]
["",41,47.6371951219512,2858,58.3158385817588,20.4,3.18404478656403,3184.04478656403,2958,26,73,"",null,null,null,{"$f":"EEPROM16!O18","v":":10E0E0007300740075007500760077007800790081"},null,{"$f":"EEPROM16!Q18","v":"73 74 75 75   76 77 78 79"},null,{"$f":"DEC2HEX(EEPROM16!M$5,2)","v":"2C"},null,null,null,null,"73         ;2858rpm | 20.4° | 3.18ms "]
["",42,46.5029761904762,2790,59.7371565113501,19.7,3.30346475507766,3303.46475507766,3077,27,76,"","Nbr of teeth on rotor",1,{"$f":"IF(N36=2,1,0)","v":0},{"$f":"EEPROM16!O19","v":":10E0F0007A007B007C007D007E007F008000810034"},null,{"$f":"EEPROM16!Q19","v":"7A 7B 7C 7D   7E 7F 80 81"},null,{"$f":"DEC2HEX(EEPROM16!F$6,2)","v":"2E"},null,null,null,null,"76         ;2790rpm | 19.7° | 3.3ms "]
["",43,45.421511627907,2725,61.1620795107034,19,3.42507645259939,3425.07645259939,3199,28,79,"",null,null,null,{"$f":"EEPROM16!O20","v":":10E1000082008200830084008500860087008800EA"},null,{"$f":"EEPROM16!Q20","v":"82 82 83 84   85 86 87 88"},null,{"$f":"DEC2HEX(EEPROM16!G$6,2)","v":"30"},null,null,null,null,"79         ;2725rpm | 19° | 3.43ms "]
["",44,44.3892045454545,2663,62.5860558267618,18.4,3.54237075979472,3542.37075979472,3316,29,82,"","Led blink at startup","yes",{"$f":"IF(N38=\"yes\",1,0)","v":1},{"$f":"EEPROM16!O21","v":":10E1100089008A008B008C008D008D008E008F009E"},null,{"$f":"EEPROM16!Q21","v":"89 8A 8B 8C   8D 8D 8E 8F"},null,{"$f":"DEC2HEX(EEPROM16!H$6,2)","v":"32"},null,null,null,null,"82         ;2663rpm | 18.4° | 3.54ms "]
["",45,43.4027777777778,2604,64.0040962621608,17.8,3.6610343061956,3661.0343061956,3435,30,85,"",null,null,null,{"$f":"EEPROM16!O22","v":":10E120009000910092009300940095009600970053"},null,{"$f":"EEPROM16!Q22","v":"90 91 92 93   94 95 96 97"},null,{"$f":"DEC2HEX(EEPROM16!I$6,2)","v":"34"},null,null,null,null,"85         ;2604rpm | 17.8° | 3.66ms "]
["",46,42.4592391304348,2547,65.4364611961785,17.3,3.7756838110195,3775.6838110195,3549,31,88,"","First measure","yes",{"$f":"IF(N40=\"yes\",1,0)","v":1},{"$f":"EEPROM16!O23","v":":10E13000980099009A009A009B009C009D009E0008"},null,{"$f":"EEPROM16!Q23","v":"98 99 9A 9A   9B 9C 9D 9E"},null,{"$f":"DEC2HEX(EEPROM16!J$6,2)","v":"37"},null,null,null,null,"88         ;2547rpm | 17.3° | 3.78ms "]
["",47,41.5558510638298,2493,{"$f":"((1000*1000*60)/($N$24*D41))/360","v":66.8538574675759},16.7,{"$f":"(E41*($F$5-F41))/1000","v":3.89757989035968},{"$f":"E41*($F$5-F41)","v":3897.57989035968},3671,32,91,{"$f":"IF($I41/$K$5>255,CONCATENATE(\"WARNING: Timing will be more then \",F41,\"°\"),\"\")","v":""},null,null,null,{"$f":"EEPROM16!O24","v":":10E1400000000000000000000000000000000000CF"},null,{"$f":"EEPROM16!Q24","v":"00 00 00 00   00 00 00 00"},null,{"$f":"DEC2HEX(EEPROM16!K$6,2)","v":"3A"},null,null,null,null,{"$f":"CONCATENATE(K41,\"         ;\",ROUND(D41,0),\"rpm | \",ROUND(F41,1),\"° | \",,ROUND(G41,2),\"ms \")","v":"91         ;2493rpm | 16.7° | 3.9ms "}]
[{"$f":"IF($B42>255,CONCATENATE(\"ERROR: Timer1H too large\"),\"\")","v":""},{"$f":"IF((B41+1)<(N$44+$B$9),B41+1,\"- End -\")","v":48},40.6901041666667,2441,68.2780281305476,16.2,4.0147480540762,4014.7480540762,3788,33,94,"","Noise Filtering","yes",{"$f":"IF(N42=\"yes\",1,0)","v":1},{"$f":"EEPROM16!O25","v":":10E1500000000000000000000000000000000000BF"},null,{"$f":"EEPROM16!Q25","v":"00 00 00 00   00 00 00 00"},null,{"$f":"DEC2HEX(EEPROM16!L$6,2)","v":"3D"},null,null,null,null,"94         ;2441rpm | 16.2° | 4.01ms "]
["",49,39.859693877551,2391,69.7058413495051,15.7,4.13355639202565,4133.55639202565,3907,34,97,"",null,null,null,{"$f":"EEPROM16!O26","v":":10E1600000000000000000000000000000000000AF"},null,{"$f":"EEPROM16!Q26","v":"00 00 00 00   00 00 00 00"},null,{"$f":"DEC2HEX(EEPROM16!M$6,2)","v":"40"},null,null,null,null,"97         ;2391rpm | 15.7° | 4.13ms "]
["",50,39.0625,2343,71.1338739507754,15.3,4.24669227486129,4246.69227486129,4020,35,100,"","Number of lines",160,null,{"$f":"EEPROM16!O27","v":":10E17000000000000000000000000000000000009F"},null,{"$f":"EEPROM16!Q27","v":"00 00 00 00   00 00 00 00"},null,{"$f":"DEC2HEX(EEPROM16!F7,2)","v":"43"},null,null,null,null,"100         ;2343rpm | 15.3° | 4.25ms "]
["",51,38.296568627451,2297,72.5584095196633,14.9,4.36076041213176,4360.76041213176,4134,36,103,"","5 h",null,null,{"$f":"EEPROM16!O28","v":":10E18000000000000000000000000000000000008F"},null,{"$f":"EEPROM16!Q28","v":"00 00 00 00   00 00 00 00"},null,{"$f":"DEC2HEX(EEPROM16!G7,2)","v":"46"},null,null,null,null,"103         ;2297rpm | 14.9° | 4.36ms "]
["",52,37.5600961538462,2253,73.9754401538689,14.5,4.47551412930907,4475.51412930907,4249,37,106,"",null,null,null,{"$f":"EEPROM16!O29","v":":10E19000000000000000000000000000000000007F"},null,{"$f":"EEPROM16!Q29","v":"00 00 00 00   00 00 00 00"},null,{"$f":"DEC2HEX(EEPROM16!H7,2)","v":"49"},null,null,null,null,"106         ;2253rpm | 14.5° | 4.48ms "]
["",53,36.8514150943396,2211,75.3806723955978,14.2,4.58314488165235,4583.14488165235,4357,38,108,"",null,null,null,{"$f":"EEPROM16!O30","v":":10E1A000000000000000000000000000000000006F"},null,{"$f":"EEPROM16!Q30","v":"00 00 00 00   00 00 00 00"},null,{"$f":"DEC2HEX(EEPROM16!I7,2)","v":"4C"},null,null,null,null,"108         ;2211rpm | 14.2° | 4.58ms "]
["",54,36.1689814814815,2170,76.8049155145929,13.9,4.69278033794163,4692.78033794163,4466,39,111,"",null,null,null,{"$f":"EEPROM16!O31","v":":10E1B000000000000000000000000000000000005F"},null,{"$f":"EEPROM16!Q31","v":"00 00 00 00   00 00 00 00"},null,{"$f":"DEC2HEX(EEPROM16!J7,2)","v":"4F"},null,null,null,null,"111         ;2170rpm | 13.9° | 4.69ms "]
["",55,35.5113636363636,2130,78.2472613458529,13.6,4.80438184663537,4804.38184663537,4578,40,114,"",null,null,null,{"$f":"EEPROM16!O32","v":":10E1C000000000000000000000000000000000004F"},null,{"$f":"EEPROM16!Q32","v":"00 00 00 00   00 00 00 00"},null,{"$f":"DEC2HEX(EEPROM16!K7,2)","v":"52"},null,null,null,null,"114         ;2130rpm | 13.6° | 4.8ms "]
["",56,34.8772321428571,2092,79.6685787125558,13.3,4.91555130656469,4915.55130656469,4689,41,117,"",null,null,null,{"$f":"EEPROM16!O33","v":":10E1D0004F001900010000000000000000000000D6"},null,{"$f":"EEPROM16!Q33","v":"4F 19 01 00   00 00 00 00"},null,{"$f":"DEC2HEX(EEPROM16!L7,2)","v":"55"},null,null,null,null,"117         ;2092rpm | 13.3° | 4.92ms "]
["",57,34.265350877193,2055,81.10300081103,13.1,5.02027575020276,5020.27575020276,4794,42,119,"",null,null,null,{"$f":"EEPROM16!O34","v":":10E1E000A00000004B000100C80001000100000079"},null,{"$f":"EEPROM16!Q34","v":"A0 00 4B 01   C8 01 01 00"},null,{"$f":"DEC2HEX(EEPROM16!M7,2)","v":"58"},null,null,null,null,"119         ;2055rpm | 13.1° | 5.02ms "]
["",58,33.6745689655172,2020,82.5082508250825,12.8,5.13201320132013,5132.01320132013,4906,43,122,"",null,null,null,{"$f":"EEPROM16!O35","v":":10E1F0005C001E0063000800000028000F00AE0055"},null,{"$f":"EEPROM16!Q35","v":"5C 1E 63 08   00 28 0F AE"},null,{"$f":"DEC2HEX(EEPROM16!F8,2)","v":"5B"},null,null,null,null,"122         ;2020rpm | 12.8° | 5.13ms "]
["",59,33.103813559322,1986,83.9207787848271,12.6,5.23665659617321,5236.65659617321,5010,44,125,"",null,null,null,{"$f":"EEPROM16!O36","v":":00000001FF"},null,null,null,{"$f":"DEC2HEX(EEPROM16!G8,2)","v":"5E"},null,null,null,null,"125         ;1986rpm | 12.6° | 5.24ms "]
["",60,32.5520833333333,1953,85.3387950162144,12.4,5.34220856801502,5342.20856801502,5116,45,127,"",null,null,null,null,null,null,null,{"$f":"DEC2HEX(EEPROM16!H8,2)","v":"61"},null,null,null,null,"127         ;1953rpm | 12.4° | 5.34ms "]
["",61,32.0184426229508,1921,86.7603678639597,12.2,5.44855110185667,5448.55110185667,5222,46,130,"",null,null,null,null,null,null,null,{"$f":"DEC2HEX(EEPROM16!I8,2)","v":"64"},null,null,null,null,"130         ;1921rpm | 12.2° | 5.45ms "]
["",62,31.5020161290323,1890,88.1834215167548,12,5.55555555555555,5555.55555555555,5329,47,133,"",null,null,null,null,null,null,null,{"$f":"DEC2HEX(EEPROM16!J8,2)","v":"67"},null,null,null,null,"133         ;1890rpm | 12° | 5.56ms "]
["",63,31.0019841269841,1860,89.6057347670251,11.8,5.66308243727599,5663.08243727599,5437,48,135,"",null,null,null,null,null,null,null,{"$f":"DEC2HEX(EEPROM16!K8,2)","v":"6A"},null,null,null,null,"135         ;1860rpm | 11.8° | 5.66ms "]
["",64,30.517578125,1831,91.0249408337885,11.7,5.76187875477881,5761.87875477881,5535,49,138,"",null,null,null,null,null,null,null,{"$f":"DEC2HEX(EEPROM16!L8,2)","v":"6C"},null,null,null,null,"138         ;1831rpm | 11.7° | 5.76ms "]
["",65,30.0480769230769,1802,92.4898261191269,11.5,5.87310395856456,5873.10395856456,5647,50,141,"",null,null,null,null,null,null,"x",{"$f":"DEC2HEX(EEPROM16!M8,2)","v":"6F"},null,null,null,null,"141         ;1802rpm | 11.5° | 5.87ms "]
["",66,29.592803030303,1775,93.8967136150235,11.4,5.97183098591549,5971.8309859155,5745,51,143,"",null,null,null,null,null,null,null,{"$f":"DEC2HEX(EEPROM16!F9,2)","v":"72"},null,null,null,null,"143         ;1775rpm | 11.4° | 5.97ms "]
["",67,29.1511194029851,1749,95.2925481227368,11.3,6.07013531541833,6070.13531541833,5844,52,146,"",null,null,null,null,null,null,null,{"$f":"DEC2HEX(EEPROM16!G9,2)","v":"75"},null,null,null,null,"146         ;1749rpm | 11.3° | 6.07ms "]
["",68,28.7224264705882,1723,96.7305088024763,11.1,6.18107951247824,6181.07951247824,5955,53,148,"",null,null,null,null,null,null,null,{"$f":"DEC2HEX(EEPROM16!H9,2)","v":"77"},null,null,null,null,"148         ;1723rpm | 11.1° | 6.18ms "]
["",69,28.3061594202899,1698,98.1546917942678,11,6.28190027483314,6281.90027483314,6055,54,151,"",null,null,null,null,null,null,null,{"$f":"DEC2HEX(EEPROM16!I9,2)","v":"7A"},null,null,null,null,"151         ;1698rpm | 11° | 6.28ms "]
["",70,27.9017857142857,1674,99.5619275189168,10.8,6.39187574671446,6391.87574671446,6165,55,154,"",null,null,null,null,null,null,null,{"$f":"DEC2HEX(EEPROM16!J9,2)","v":"7D"},null,null,null,null,"154         ;1674rpm | 10.8° | 6.39ms "]
["",71,27.5088028169014,1650,101.010101010101,10.7,6.49494949494949,6494.94949494949,6268,56,156,"",null,null,null,null,null,null,null,{"$f":"DEC2HEX(EEPROM16!K9,2)","v":"7F"},null,null,null,null,"156         ;1650rpm | 10.7° | 6.49ms "]
["",72,27.1267361111111,1627,102.438024994878,10.6,6.59700880967014,6597.00880967014,6371,57,159,"",null,null,null,null,null,null,null,{"$f":"DEC2HEX(EEPROM16!L9,2)","v":"82"},null,null,null,null,"159         ;1627rpm | 10.6° | 6.6ms "]
["",73,26.7551369863014,1605,103.842159916926,10.5,6.69781931464173,6697.81931464173,6471,58,161,"",null,null,null,null,null,null,"x",{"$f":"DEC2HEX(EEPROM16!M9,2)","v":"85"},null,null,null,null,"161         ;1605rpm | 10.5° | 6.7ms "]
["",74,26.3935810810811,1583,105.285323225942,10.4,6.80143188039585,6801.43188039585,6575,59,164,"",null,null,null,null,null,null,null,{"$f":"DEC2HEX(EEPROM16!F10,2)","v":"87"},null,null,null,null,"164         ;1583rpm | 10.4° | 6.8ms "]
["",75,26.0416666666667,1562,106.700810926163,10.4,6.89287238583013,6892.87238583013,6666,60,166,"",null,null,null,null,null,null,null,{"$f":"DEC2HEX(EEPROM16!G10,2)","v":"8A"},null,null,null,null,"166         ;1562rpm | 10.4° | 6.89ms "]
["",76,25.6990131578947,1541,108.154877784988,10.3,6.99762059268872,6997.62059268872,6771,61,169,"",null,null,null,null,null,null,null,{"$f":"DEC2HEX(EEPROM16!H10,2)","v":"8D"},null,null,null,null,"169         ;1541rpm | 10.3° | 7ms "]
["",77,25.3652597402597,1521,109.577032653956,10.2,7.10059171597635,7100.59171597635,6874,62,171,"",null,null,null,null,null,null,null,{"$f":"DEC2HEX(EEPROM16!I10,2)","v":"8F"},null,null,null,null,"171         ;1521rpm | 10.2° | 7.1ms "]
["",78,25.0400641025641,1502,110.963160230803,10.2,7.19041278295603,7190.41278295603,6964,63,174,"",null,null,null,null,null,null,null,{"$f":"DEC2HEX(EEPROM16!J10,2)","v":"92"},null,null,null,null,"174         ;1502rpm | 10.2° | 7.19ms "]
["",79,24.7231012658228,1483,{"$f":"((1000*1000*60)/($N$24*D73))/360","v":112.384805574286},10.05,{"$f":"(E73*($F$5-F73))/1000","v":7.29939312204988},{"$f":"E73*($F$5-F73)","v":7299.39312204988},7073,64,{"$f":"IFERROR(IF($I73/$K$5>255,255,IF($I73>0.01,INT($I73/$K$5),1)),255)","v":176},{"$f":"IF($I73/$K$5>255,CONCATENATE(\"WARNING: Timing will be more then \",F73,\"°\"),\"\")","v":""},null,null,null,null,null,null,null,{"$f":"DEC2HEX(EEPROM16!K10,2)","v":"94"},null,null,null,null,{"$f":"CONCATENATE(K73,\"         ;\",ROUND(D73,0),\"rpm | \",ROUND(F73,1),\"° | \",,ROUND(G73,2),\"ms \")","v":"176         ;1483rpm | 10.1° | 7.3ms "}]
[{"$f":"IF($B74>255,CONCATENATE(\"ERROR: Timer1H too large\"),\"\")","v":""},{"$f":"IF((B73+1)<(N$44+$B$9),B73+1,\"- End -\")","v":80},{"$f":"IFERROR(1000000/(B74*256*($N$30/$C$4)),\"\")","v":24.4140625},1464,113.84335154827,10.1,7.38843351548272,7388.43351548272,7162,65,179,"",null,null,null,null,null,null,null,{"$f":"DEC2HEX(EEPROM16!L10,2)","v":"97"},null,null,null,null,"179         ;1464rpm | 10.1° | 7.39ms "]
["",81,24.1126543209877,{"$f":"INT(60*C75*$N$25/2*$N$24)","v":1446},115.260488704472,10.05,7.48616874135546,7486.16874135546,{"$f":"IF($H75>$I$4+$I$6,INT($H75-$I$4-$I$6),\"out of range\")","v":7260},66,181,"",null,null,null,null,null,null,"x",{"$f":"DEC2HEX(EEPROM16!M10,2)","v":"9A"},null,null,null,null,"181         ;1446rpm | 10.1° | 7.49ms "]
["",82,23.8185975609756,1429,116.631677163518,10,7.58105901562867,7581.05901562867,7355,67,183,"",null,null,null,null,null,null,null,{"$f":"DEC2HEX(EEPROM16!F11,2)","v":"9C"},null,null,null,null,"183         ;1429rpm | 10° | 7.58ms "]
["",83,23.5316265060241,1411,118.119536971415,10,7.67776990314198,7677.76990314198,7451,68,186,"",null,null,null,null,null,null,null,{"$f":"DEC2HEX(EEPROM16!G11,2)","v":"9F"},null,null,null,null,"186         ;1411rpm | 10° | 7.68ms "]
["",84,23.2514880952381,1395,119.4743130227,10,7.7658303464755,7765.8303464755,7539,69,188,"",null,null,null,null,null,null,null,{"$f":"DEC2HEX(EEPROM16!H11,2)","v":"A1"},null,null,null,null,"188         ;1395rpm | 10° | 7.77ms "]
["",85,22.9779411764706,1378,120.948234155781,10,7.86163522012577,7861.63522012577,7635,70,190,"",null,null,null,null,null,null,null,{"$f":"DEC2HEX(EEPROM16!I11,2)","v":"A4"},null,null,null,null,"190         ;1378rpm | 10° | 7.86ms "]
["",86,22.7107558139535,1362,122.369065100343,10,7.95398923152229,7953.98923152229,7727,71,193,"",null,null,null,null,null,null,null,{"$f":"DEC2HEX(EEPROM16!J11,2)","v":"A6"},null,null,null,null,"193         ;1362rpm | 10° | 7.95ms "]
["",87,22.4497126436782,1346,123.823675086677,10,8.04853888063401,8048.53888063401,7822,72,195,"",null,null,null,null,null,null,null,{"$f":"DEC2HEX(EEPROM16!K11,2)","v":"A9"},null,null,null,null,"195         ;1346rpm | 10° | 8.05ms "]
["",88,22.1946022727273,1331,125.219133483596,10,8.13924367643374,8139.24367643374,7913,73,197,"",null,null,null,null,null,null,null,{"$f":"DEC2HEX(EEPROM16!L11,2)","v":"AB"},null,null,null,null,"197         ;1331rpm | 10° | 8.14ms "]
["",89,21.9452247191011,1316,126.646403242148,10,8.23201621073962,8232.01621073962,8006,74,200,"",null,null,null,null,null,null,"x",{"$f":"DEC2HEX(EEPROM16!M11,2)","v":"AE"},null,null,null,null,"200         ;1316rpm | 10° | 8.23ms "]
["",90,21.7013888888889,1302,128.008192524322,10,8.32053251408093,8320.53251408093,8094,75,202,"",null,null,null,null,null,null,null,{"$f":"DEC2HEX(EEPROM16!F12,2)","v":"B0"},null,null,null,null,"202         ;1302rpm | 10° | 8.32ms "]
["",91,21.4629120879121,1287,129.50012950013,10,8.41750841750845,8417.50841750845,8191,76,204,"",null,null,null,null,null,null,null,{"$f":"DEC2HEX(EEPROM16!G12,2)","v":"B3"},null,null,null,null,"204         ;1287rpm | 10° | 8.42ms "]
["",92,21.2296195652174,1273,130.924325739722,10,8.51008117308193,8510.08117308193,8284,77,207,"",null,null,null,null,null,null,null,{"$f":"DEC2HEX(EEPROM16!H12,2)","v":"B5"},null,null,null,null,"207         ;1273rpm | 10° | 8.51ms "]
["",93,21.0013440860215,1260,132.275132275132,10,8.59788359788358,8597.88359788358,8371,78,209,"",null,null,null,null,null,null,null,{"$f":"DEC2HEX(EEPROM16!I12,2)","v":"B7"},null,null,null,null,"209         ;1260rpm | 10° | 8.6ms "]
["",94,20.7779255319149,1246,133.761369716426,10,8.69448903156769,8694.48903156769,8468,79,211,"",null,null,null,null,null,null,null,{"$f":"DEC2HEX(EEPROM16!J12,2)","v":"BA"},null,null,null,null,"211         ;1246rpm | 10° | 8.69ms "]
["",95,20.5592105263158,1233,135.171668018383,10,8.7861584211949,8786.1584211949,8560,0,{"$f":"IFERROR(IF($I89/100>255,255,IF($I89>0.01,INT($I89/100),1)),255)","v":85},{"$f":"IF($I89/100>255,CONCATENATE(\"WARNING: Timing will be more then \",F89,\"°\"),\"\")","v":""},null,null,null,null,null,null,null,{"$f":"DEC2HEX(EEPROM16!K12,2)","v":"BC"},null,null,null,null,"85         ;1233rpm | 10° | 8.79ms "]
["",96,20.3450520833333,1220,136.612021857924,10,8.87978142076506,8879.78142076506,8653,1,{"$f":"IFERROR(IF($I90/100>255,255,IF($I90>0.01,INT($I90/100),1)),255)","v":86},{"$f":"IF($I90/100>255,CONCATENATE(\"WARNING: Timing will be more then \",F90,\"°\"),\"\")","v":""},null,null,null,null,null,null,null,{"$f":"DEC2HEX(EEPROM16!L12,2)","v":"BE"},null,null,null,null,"86         ;1220rpm | 10° | 8.88ms "]
["",97,20.1353092783505,1208,137.969094922737,10,8.96799116997791,8967.99116997791,8741,2,{"$f":"IFERROR(IF($I91/100>255,255,IF($I91>0.01,INT($I91/100),1)),255)","v":87},"",null,null,null,null,null,null,"x",{"$f":"DEC2HEX(EEPROM16!M12,2)","v":"C1"},null,null,null,null,"87         ;1208rpm | 10° | 8.97ms "]
["",98,19.9298469387755,1195,139.470013947001,10,9.06555090655507,9065.55090655506,8839,3,88,"",null,null,null,null,null,null,null,{"$f":"DEC2HEX(EEPROM16!F13,2)","v":"C3"},null,null,null,null,"88         ;1195rpm | 10° | 9.07ms "]
["",99,19.7285353535354,1183,140.884756269372,10,9.15750915750918,9157.50915750918,8931,4,89,"",null,null,null,null,null,null,null,{"$f":"DEC2HEX(EEPROM16!G13,2)","v":"C5"},null,null,null,null,"89         ;1183rpm | 10° | 9.16ms "]
["",100,19.53125,1171,142.328494164532,10,9.25135212069458,9251.35212069458,9025,5,90,"",null,null,null,null,null,null,null,{"$f":"DEC2HEX(EEPROM16!H13,2)","v":"C8"},null,null,null,null,"90         ;1171rpm | 10° | 9.25ms "]
["",101,19.3378712871287,1160,143.67816091954,10,9.3390804597701,9339.0804597701,9113,6,91,"",null,null,null,null,null,null,null,{"$f":"DEC2HEX(EEPROM16!I13,2)","v":"CA"},null,null,null,null,"91         ;1160rpm | 10° | 9.34ms "]
["",102,19.1482843137255,1148,145.180023228804,10,9.43670150987226,9436.70150987226,9210,7,92,"",null,null,null,null,null,null,null,{"$f":"DEC2HEX(EEPROM16!J13,2)","v":"CC"},null,null,null,null,"92         ;1148rpm | 10° | 9.44ms "]
["",103,18.9623786407767,1137,146.584579302257,10,9.5279976546467,9527.9976546467,9301,8,93,"",null,null,null,null,null,null,null,{"$f":"DEC2HEX(EEPROM16!K13,2)","v":"CF"},null,null,null,null,"93         ;1137rpm | 10° | 9.53ms "]
["",104,18.7800480769231,1126,148.01657785672,10,9.6210775606868,9621.0775606868,9395,9,93,"",null,null,null,null,null,null,null,{"$f":"DEC2HEX(EEPROM16!L13,2)","v":"D1"},null,null,null,null,"93         ;1126rpm | 10° | 9.62ms "]
["",105,18.6011904761905,1116,149.342891278375,10,9.70728793309437,9707.28793309437,9481,10,94,"",null,null,null,null,null,null,"x",{"$f":"DEC2HEX(EEPROM16!M13,2)","v":"D3"},null,null,null,null,"94         ;1116rpm | 10° | 9.71ms "]
["",106,18.4257075471698,1105,150.829562594268,10,9.80392156862742,9803.92156862742,9577,11,95,"",null,null,null,null,null,null,null,{"$f":"DEC2HEX(EEPROM16!F14,2)","v":"55"},null,null,null,null,"95         ;1105rpm | 10° | 9.8ms "]
["",107,18.2535046728972,1095,152.20700152207,10,9.89345509893455,9893.45509893455,9667,12,96,"",null,null,null,null,null,null,null,{"$f":"DEC2HEX(EEPROM16!G14,2)","v":"56"},null,null,null,null,"96         ;1095rpm | 10° | 9.89ms "]
["",108,18.0844907407407,1085,153.609831029186,10,9.98463901689709,9984.63901689709,9758,13,97,"",null,null,null,null,null,null,null,{"$f":"DEC2HEX(EEPROM16!H14,2)","v":"57"},null,null,null,null,"97         ;1085rpm | 10° | 9.98ms "]
["",109,17.9185779816514,1075,155.038759689922,10,10.0775193798449,10077.5193798449,9851,14,98,"",null,null,null,null,null,null,null,{"$f":"DEC2HEX(EEPROM16!I14,2)","v":"58"},null,null,null,null,"98         ;1075rpm | 10° | 10.08ms "]
["",110,17.7556818181818,1065,156.494522691706,10,{"$f":"(E104*($F$5-F104))/1000","v":10.1721439749609},{"$f":"E104*($F$5-F104)","v":10172.1439749609},9946,15,99,"",null,null,null,null,null,null,null,{"$f":"DEC2HEX(EEPROM16!J14,2)","v":"59"},null,null,null,null,"99         ;1065rpm | 10° | 10.17ms "]
["",111,17.5957207207207,1055,157.977883096366,10,10.2685624012638,10268.5624012638,10042,16,100,"",null,null,null,null,null,null,null,{"$f":"DEC2HEX(EEPROM16!K14,2)","v":"5A"}]
["",{"$f":"IF((B105+1)<(N$44+$B$9),B105+1,\"- End -\")","v":112},17.4386160714286,1046,159.337157425112,10,10.3569152326323,10356.9152326323,10130,17,101,"",null,null,null,null,null,null,null,{"$f":"DEC2HEX(EEPROM16!L14,2)","v":"5B"}]
["",113,17.2842920353982,1037,160.720025715204,10,10.4468016714883,10446.8016714883,10220,18,102,"",null,null,null,null,null,null,"x",{"$f":"DEC2HEX(EEPROM16!M14,2)","v":"5C"}]
["",114,17.1326754385965,1027,162.284972411555,10,10.5485232067511,10548.5232067511,10322,19,103,"",null,null,null,null,null,null,null,{"$f":"DEC2HEX(EEPROM16!F15,2)","v":"5D"}]
["",115,16.9836956521739,1019,163.559044815178,10,10.6313379129866,10631.3379129866,10405,20,104,"",null,null,null,null,null,null,null,{"$f":"DEC2HEX(EEPROM16!G15,2)","v":"5D"}]
["",116,16.8372844827586,1010,165.016501650165,10,10.7260726072607,10726.0726072607,10500,21,105,"",null,null,null,null,null,null,null,{"$f":"DEC2HEX(EEPROM16!H15,2)","v":"5E"}]
["",117,16.6933760683761,1001,166.500166500167,10,10.8225108225109,10822.5108225109,10596,22,105,"",null,null,null,null,null,null,null,{"$f":"DEC2HEX(EEPROM16!I15,2)","v":"5F"}]
["",118,16.551906779661,993,167.841557569654,10,10.9097012420275,10909.7012420275,10683,23,106,"",null,null,null,null,null,null,null,{"$f":"DEC2HEX(EEPROM16!J15,2)","v":"60"}]
["",119,16.4128151260504,984,169.376693766938,10,11.009485094851,11009.485094851,10783,24,107,"",null,null,null,null,null,null,null,{"$f":"DEC2HEX(EEPROM16!K15,2)","v":"61"}]
["",120,16.2760416666667,976,170.765027322404,10,11.0997267759563,11099.7267759563,10873,25,108,"",null,null,null,null,null,null,null,{"$f":"DEC2HEX(EEPROM16!L15,2)","v":"62"}]
["",121,16.1415289256198,968,172.176308539945,10,11.1914600550964,11191.4600550964,10965,26,109,"",null,null,null,null,null,null,"x",{"$f":"DEC2HEX(EEPROM16!M15,2)","v":"63"}]
["",122,16.0092213114754,960,173.611111111111,10,11.2847222222222,11284.7222222222,11058,27,110,"",null,null,null,null,null,null,null,{"$f":"DEC2HEX(EEPROM16!F16,2)","v":"64"}]
["",123,15.8790650406504,952,175.070028011204,10,11.3795518207283,11379.5518207283,11153,28,111,"",null,null,null,null,null,null,null,{"$f":"DEC2HEX(EEPROM16!G16,2)","v":"65"}]
["",124,15.7510080645161,945,176.36684303351,10,11.4638447971781,11463.8447971781,11237,29,112,"",null,null,null,null,null,null,null,{"$f":"DEC2HEX(EEPROM16!H16,2)","v":"66"}]
["",125,15.625,937,177.872643187478,10,11.5617218071861,11561.7218071861,11335,30,113,"",null,null,null,null,null,null,null,{"$f":"DEC2HEX(EEPROM16!I16,2)","v":"67"}]
["",126,15.5009920634921,930,179.21146953405,10,11.6487455197133,11648.7455197132,11422,31,114,"",null,null,null,null,null,null,null,{"$f":"DEC2HEX(EEPROM16!J16,2)","v":"68"}]
["",127,15.378937007874,922,180.766449746927,10,11.7498192335503,11749.8192335503,11523,32,115,"",null,null,null,null,null,null,null,{"$f":"DEC2HEX(EEPROM16!K16,2)","v":"69"}]
["",128,15.2587890625,915,182.149362477231,10,11.83970856102,11839.70856102,11613,33,116,"",null,null,null,null,null,null,null,{"$f":"DEC2HEX(EEPROM16!L16,2)","v":"69"}]
["",129,15.140503875969,908,183.553597650514,10,11.9309838472834,11930.9838472834,11704,34,117,"",null,null,null,null,null,null,"x",{"$f":"DEC2HEX(EEPROM16!M16,2)","v":"6A"}]
["",130,15.0240384615385,901,184.979652238254,10,12.0236773954865,12023.6773954865,11797,35,117,"",null,null,null,null,null,null,null,{"$f":"DEC2HEX(EEPROM16!F17,2)","v":"6B"}]
["",131,14.9093511450382,894,186.428038777032,10,12.1178225205071,12117.8225205071,11891,36,118,"",null,null,null,null,null,null,null,{"$f":"DEC2HEX(EEPROM16!G17,2)","v":"6C"}]
["",132,14.7964015151515,887,187.899285982713,10,12.2134535888763,12213.4535888763,11987,37,119,"",null,null,null,null,null,null,null,{"$f":"DEC2HEX(EEPROM16!H17,2)","v":"6D"}]
["",133,14.6851503759399,881,189.178963299281,10,12.2966326144533,12296.6326144533,12070,38,120,"",null,null,null,null,null,null,null,{"$f":"DEC2HEX(EEPROM16!I17,2)","v":"6E"}]
["",134,14.5755597014925,874,190.6941266209,10,{"$f":"(E128*($F$5-F128))/1000","v":12.3951182303585},{"$f":"E128*($F$5-F128)","v":12395.1182303585},12169,39,121,"",null,null,null,null,null,null,null,{"$f":"DEC2HEX(EEPROM16!J17,2)","v":"6F"}]
["",135,14.4675925925926,868,192.012288786482,10,12.4807987711213,12480.7987711213,12254,40,122,"",null,null,null,null,null,null,null,{"$f":"DEC2HEX(EEPROM16!K17,2)","v":"70"}]
["",136,14.3612132352941,861,193.573364305072,10,12.5822686798297,12582.2686798297,12356,41,123,"",null,null,null,null,null,null,null,{"$f":"DEC2HEX(EEPROM16!L17,2)","v":"71"}]
["",137,14.2563868613139,855,194.931773879142,10,12.6705653021442,12670.5653021442,12444,42,124,"",null,null,null,null,null,null,"x",{"$f":"DEC2HEX(EEPROM16!M17,2)","v":"72"}]
["",138,14.1530797101449,849,196.309383588536,10,12.7601099332548,12760.1099332548,12534,43,125,"",null,null,null,null,null,null,null,{"$f":"DEC2HEX(EEPROM16!F18,2)","v":"73"}]
["",139,14.0512589928058,843,197.706603400554,10,12.850929221036,12850.929221036,12624,44,126,"",null,null,null,null,null,null,null,{"$f":"DEC2HEX(EEPROM16!G18,2)","v":"74"}]
["",140,13.9508928571429,837,199.123855037834,10,12.9430505774592,12943.0505774592,12717,45,127,"",null,null,null,null,null,null,null,{"$f":"DEC2HEX(EEPROM16!H18,2)","v":"75"}]
["",141,13.8519503546099,831,200.561572402728,10,13.0365022061773,13036.5022061773,12810,46,128,"",null,null,null,null,null,null,null,{"$f":"DEC2HEX(EEPROM16!I18,2)","v":"75"}]
["",142,13.7544014084507,825,202.020202020202,10,13.1313131313131,13131.3131313131,12905,47,129,"",null,null,null,null,null,null,null,{"$f":"DEC2HEX(EEPROM16!J18,2)","v":"76"}]
["",143,13.6582167832168,819,{"$f":"((1000*1000*60)/($N$24*D137))/360","v":203.500203500203},10,13.2275132275132,13227.5132275132,13001,48,130,"",null,null,null,null,null,null,null,{"$f":"DEC2HEX(EEPROM16!K18,2)","v":"77"}]
[{"$f":"IF($B138>255,CONCATENATE(\"ERROR: Timer1H too large\"),\"\")","v":""},{"$f":"IF((B137+1)<(N$44+$B$9),B137+1,\"- End -\")","v":144},{"$f":"IFERROR(1000000/(B138*256*($N$30/$C$4)),\"\")","v":13.5633680555556},813,205.0020500205,10,13.3251332513325,13325.1332513325,13099,49,130,"",null,null,null,null,null,null,null,{"$f":"DEC2HEX(EEPROM16!L18,2)","v":"78"}]
["",145,13.4698275862069,{"$f":"INT(60*C139*$N$25/2*$N$24)","v":808},206.270627062706,10,13.4075907590759,13407.5907590759,{"$f":"IF($H139>$I$4+$I$6,INT($H139-$I$4-$I$6),\"out of range\")","v":13181},50,131,"",null,null,null,null,null,null,"x",{"$f":"DEC2HEX(EEPROM16!M18,2)","v":"79"}]
["",146,13.3775684931507,802,207.813798836243,10,13.5078969243558,13507.8969243558,13281,51,132,"",null,null,null,null,null,null,null,{"$f":"DEC2HEX(EEPROM16!F19,2)","v":"7A"}]
["",147,13.2865646258503,797,209.117524048515,10,13.5926390631535,13592.6390631535,13366,52,133,"",null,null,null,null,null,null,null,{"$f":"DEC2HEX(EEPROM16!G19,2)","v":"7B"}]
["",148,13.1967905405405,791,210.703750526759,10,13.6957437842393,13695.7437842393,13469,53,134,"",null,null,null,null,null,null,null,{"$f":"DEC2HEX(EEPROM16!H19,2)","v":"7C"}]
["",149,13.1082214765101,786,212.044105173876,10,13.7828668363019,13782.8668363019,13556,54,135,"",null,null,null,null,null,null,null,{"$f":"DEC2HEX(EEPROM16!I19,2)","v":"7D"}]
["",150,13.0208333333333,781,213.401621852326,10,13.8711054204012,13871.1054204012,13645,55,136,"",null,null,null,null,null,null,null,{"$f":"DEC2HEX(EEPROM16!J19,2)","v":"7E"}]
["",151,12.9346026490066,776,214.776632302405,10,13.9604810996563,13960.4810996563,13734,56,137,"",null,null,null,null,null,null,null,{"$f":"DEC2HEX(EEPROM16!K19,2)","v":"7F"}]
["",152,12.8495065789474,770,216.450216450216,10,14.069264069264,14069.264069264,13843,57,138,"",null,null,null,null,null,null,null,{"$f":"DEC2HEX(EEPROM16!L19,2)","v":"80"}]
["",153,12.765522875817,765,217.864923747277,10,14.161220043573,14161.220043573,13935,58,139,"",null,null,null,null,null,null,"x",{"$f":"DEC2HEX(EEPROM16!M19,2)","v":"81"}]
["",154,12.6826298701299,760,219.298245614035,10,14.2543859649123,14254.3859649123,14028,59,140,"",null,null,null,null,null,null,null,{"$f":"DEC2HEX(EEPROM16!F20,2)","v":"82"}]
["",155,12.6008064516129,756,220.458553791887,10,14.3298059964727,14329.8059964727,14103,60,141,"",null,null,null,null,null,null,null,{"$f":"DEC2HEX(EEPROM16!G20,2)","v":"82"}]
["",156,12.5200320512821,751,221.926320461607,10,14.4252108300045,14425.2108300045,14199,61,141,"",null,null,null,null,null,null,null,{"$f":"DEC2HEX(EEPROM16!H20,2)","v":"83"}]
["",157,12.4402866242038,746,223.413762287757,10,14.5218945487042,14521.8945487042,14295,62,142,"",null,null,null,null,null,null,null,{"$f":"DEC2HEX(EEPROM16!I20,2)","v":"84"}]
["",158,12.3615506329114,741,224.921277552857,10,14.6198830409357,14619.8830409357,14393,63,143,"",null,null,null,null,null,null,null,{"$f":"DEC2HEX(EEPROM16!J20,2)","v":"85"}]
["",159,12.2838050314465,737,226.142017186793,10,{"$f":"(E153*($F$5-F153))/1000","v":14.6992311171415},{"$f":"E153*($F$5-F153)","v":14699.2311171415},14473,64,144,"",null,null,null,null,null,null,null,{"$f":"DEC2HEX(EEPROM16!K20,2)","v":"86"}]
["",160,12.20703125,732,227.686703096539,10,14.799635701275,14799.635701275,14573,65,145,{"$f":"IF($I154/100>255,CONCATENATE(\"WARNING: Timing will be more then \",F154,\"°\"),\"\")","v":""},null,null,null,null,null,null,null,{"$f":"DEC2HEX(EEPROM16!L20,2)","v":"87"}]
["",161,12.1312111801242,727,229.252636405319,10,14.9014213663457,14901.4213663457,14675,66,{"$f":"IFERROR(IF($I155/100>255,255,IF($I155>0.01,INT($I155/100),1)),255)","v":146},"",null,null,null,null,null,null,"x",{"$f":"DEC2HEX(EEPROM16!M20,2)","v":"88"}]
["",162,12.0563271604938,723,230.520977408944,10,14.9838635315814,14983.8635315814,14757,67,147,"",null,null,null,null,null,null,null,{"$f":"DEC2HEX(EEPROM16!F21,2)","v":"89"}]
["",163,11.9823619631902,718,232.126276694522,10,15.0882079851439,15088.2079851439,14862,68,148,"",null,null,null,null,null,null,null,{"$f":"DEC2HEX(EEPROM16!G21,2)","v":"8A"}]
["",164,11.9092987804878,714,233.426704014939,10,15.172735760971,15172.735760971,14946,69,149,"",null,null,null,null,null,null,null,{"$f":"DEC2HEX(EEPROM16!H21,2)","v":"8B"}]
["",165,11.8371212121212,710,234.741784037559,10,15.2582159624413,15258.2159624413,15032,70,150,"",null,null,null,null,null,null,null,{"$f":"DEC2HEX(EEPROM16!I21,2)","v":"8C"}]
["",166,11.765813253012,705,236.406619385343,10,15.3664302600473,15366.4302600473,15140,71,151,"",null,null,null,null,null,null,null,{"$f":"DEC2HEX(EEPROM16!J21,2)","v":"8D"}]
["",167,11.6953592814371,701,237.755587256301,10,15.4541131716596,15454.1131716596,15228,72,152,"",null,null,null,null,null,null,null,{"$f":"DEC2HEX(EEPROM16!K21,2)","v":"8D"}]
["",168,11.625744047619,697,239.120038259206,10,15.5428024868484,15542.8024868484,15316,73,153,"",null,null,null,null,null,null,null,{"$f":"DEC2HEX(EEPROM16!L21,2)","v":"8E"}]
["",169,11.5569526627219,693,240.500240500241,10,15.6325156325157,15632.5156325157,15406,74,154,"",null,null,null,null,null,null,"x",{"$f":"DEC2HEX(EEPROM16!M21,2)","v":"8F"}]
["",170,11.4889705882353,689,241.896468311563,10,15.7232704402516,15723.2704402516,15497,75,154,"",null,null,null,null,null,null,null,{"$f":"DEC2HEX(EEPROM16!F22,2)","v":"90"}]
["",171,11.421783625731,685,243.30900243309,10,15.8150851581509,15815.0851581509,15589,76,155,"",null,null,null,null,null,null,null,{"$f":"DEC2HEX(EEPROM16!G22,2)","v":"91"}]
["",172,11.3553779069767,681,244.738130200685,10,15.9079784630445,15907.9784630445,15681,77,156,"",null,null,null,null,null,null,null,{"$f":"DEC2HEX(EEPROM16!H22,2)","v":"92"}]
["",173,11.2897398843931,677,246.184145741014,10,16.0019694731659,16001.9694731659,15775,78,157,"",null,null,null,null,null,null,null,{"$f":"DEC2HEX(EEPROM16!I22,2)","v":"93"}]
["",174,11.2248563218391,673,247.647350173353,10,16.0970777612679,16097.0777612679,15871,79,158,"",null,null,null,null,null,null,null,{"$f":"DEC2HEX(EEPROM16!J22,2)","v":"94"}]
["ERROR: Timer1H too large","- End -","",{"$error":"#VALUE!"},{"$error":"#VALUE!"},10,{"$error":"#VALUE!"},{"$error":"#VALUE!"},{"$error":"#VALUE!"},80,255,{"$error":"#VALUE!"},null,null,null,null,null,null,null,{"$f":"DEC2HEX(EEPROM16!K22,2)","v":"95"}]
[null,null,null,null,null,null,null,null,null,null,null,null,null,null,null,null,null,null,null,{"$f":"DEC2HEX(EEPROM16!L22,2)","v":"96"}]
[null,null,null,null,null,null,null,null,null,null,null,null,null,null,null,null,null,null,"x",{"$f":"DEC2HEX(EEPROM16!M22,2)","v":"97"}]
[null,null,null,null,null,null,null,null,null,null,null,null,null,null,null,null,null,null,null,{"$f":"DEC2HEX(EEPROM16!F23,2)","v":"98"}]
[null,null,null,null,null,null,null,null,null,null,null,null,null,null,null,null,null,null,null,{"$f":"DEC2HEX(EEPROM16!G23,2)","v":"99"}]
[null,null,null,null,null,null,null,null,null,null,null,null,null,null,null,null,null,null,null,{"$f":"DEC2HEX(EEPROM16!H23,2)","v":"9A"}]
[null,{"$f":"IFERROR(B9,\"\")","v":15},130.208333333333,7812,null,null,null,null,null,null,null,null,null,null,null,null,null,null,null,{"$f":"DEC2HEX(EEPROM16!I23,2)","v":"9A"}]
[null,16,122.0703125,7324,null,null,null,null,null,null,null,null,null,null,null,null,null,null,null,{"$f":"DEC2HEX(EEPROM16!J23,2)","v":"9B"}]
[null,17,114.889705882353,6893,null,null,null,null,null,null,null,null,null,null,null,null,null,null,null,{"$f":"DEC2HEX(EEPROM16!K23,2)","v":"9C"}]
[null,18,108.506944444444,6510,null,null,null,null,null,null,null,null,null,null,null,null,null,null,null,{"$f":"DEC2HEX(EEPROM16!L23,2)","v":"9D"}]
[null,19,102.796052631579,6167,null,null,null,null,null,null,null,null,null,null,null,null,null,null,"x",{"$f":"DEC2HEX(EEPROM16!M23,2)","v":"9E"}]
[null,20,97.65625,5859,null,null,null,null,null,null,null,null,null,null,null,null,null,null,null,{"$f":"DEC2HEX(EEPROM16!F24,2)","v":"00"}]
[null,21,93.0059523809524,5580,null,null,null,null,null,null,null,null,null,null,null,null,null,null,null,{"$f":"DEC2HEX(EEPROM16!G24,2)","v":"00"}]
[null,22,88.7784090909091,5326,null,null,null,null,null,null,null,null,null,null,null,null,null,null,null,{"$f":"DEC2HEX(EEPROM16!H24,2)","v":"00"}]
[null,23,84.9184782608696,5095,null,null,null,null,null,null,null,null,null,null,null,null,null,null,null,{"$f":"DEC2HEX(EEPROM16!I24,2)","v":"00"}]
[null,24,81.3802083333333,4882,null,null,null,null,null,null,null,null,null,null,null,null,null,null,null,{"$f":"DEC2HEX(EEPROM16!J24,2)","v":"00"}]
[null,25,78.125,4687,null,null,null,null,null,null,null,null,null,null,null,null,null,null,null,{"$f":"DEC2HEX(EEPROM16!K24,2)","v":"00"}]
[null,26,75.1201923076923,4507,null,null,null,null,null,null,null,null,null,null,null,null,null,null,null,{"$f":"DEC2HEX(EEPROM16!L24,2)","v":"00"}]
[null,27,72.337962962963,4340,null,null,null,null,null,null,null,null,null,null,null,null,null,null,"x",{"$f":"DEC2HEX(EEPROM16!M24,2)","v":"00"}]
[null,28,69.7544642857143,4185,null,null,null,null,null,null,null,null,null,null,null,null,null,null,null,{"$f":"DEC2HEX(EEPROM16!F25,2)","v":"00"}]
[null,29,67.3491379310345,4040,null,null,null,null,null,null,null,null,null,null,null,null,null,null,null,{"$f":"DEC2HEX(EEPROM16!G25,2)","v":"00"}]
[null,30,65.1041666666667,3906,null,null,null,null,null,null,null,null,null,null,null,null,null,null,null,{"$f":"DEC2HEX(EEPROM16!H25,2)","v":"00"}]
[null,31,63.0040322580645,3780,null,null,null,null,null,null,null,null,null,null,null,null,null,null,null,{"$f":"DEC2HEX(EEPROM16!I25,2)","v":"00"}]
[null,32,61.03515625,3662,null,null,null,null,null,null,null,null,null,null,null,null,null,null,null,{"$f":"DEC2HEX(EEPROM16!J25,2)","v":"00"}]
[null,33,59.1856060606061,3551,null,null,null,null,null,null,null,null,null,null,null,null,null,null,null,{"$f":"DEC2HEX(EEPROM16!K25,2)","v":"00"}]
[null,34,57.4448529411765,3446,null,null,null,null,null,null,null,null,null,null,null,null,null,null,null,{"$f":"DEC2HEX(EEPROM16!L25,2)","v":"00"}]
[null,{"$f":"IFERROR(B29,\"\")","v":35},55.8035714285714,3348,null,null,null,null,null,null,null,null,null,null,null,null,null,null,"x",{"$f":"DEC2HEX(EEPROM16!M25,2)","v":"00"}]
[null,36,54.2534722222222,3255,null,null,null,null,null,null,null,null,null,null,null,null,null,null,null,{"$f":"DEC2HEX(EEPROM16!F26,2)","v":"00"}]
[null,37,52.7871621621622,3167,null,null,null,null,null,null,null,null,null,null,null,null,null,null,null,{"$f":"DEC2HEX(EEPROM16!G26,2)","v":"00"}]
[null,38,51.3980263157895,3083,null,null,null,null,null,null,null,null,null,null,null,null,null,null,null,{"$f":"DEC2HEX(EEPROM16!H26,2)","v":"00"}]
[null,39,50.0801282051282,3004,null,null,null,null,null,null,null,null,null,null,null,null,null,null,null,{"$f":"DEC2HEX(EEPROM16!I26,2)","v":"00"}]
[null,40,48.828125,2929,null,null,null,null,null,null,null,null,null,null,null,null,null,null,null,{"$f":"DEC2HEX(EEPROM16!J26,2)","v":"00"}]
[null,41,47.6371951219512,2858,null,null,null,null,null,null,null,null,null,null,null,null,null,null,null,{"$f":"DEC2HEX(EEPROM16!K26,2)","v":"00"}]
[null,42,46.5029761904762,2790,null,null,null,null,null,null,null,null,null,null,null,null,null,null,null,{"$f":"DEC2HEX(EEPROM16!L26,2)","v":"00"}]
[null,43,45.421511627907,2725,null,null,null,null,null,null,null,null,null,null,null,null,null,null,"x",{"$f":"DEC2HEX(EEPROM16!M26,2)","v":"00"}]
[null,44,44.3892045454545,2663,null,null,null,null,null,null,null,null,null,null,null,null,null,null,null,{"$f":"DEC2HEX(EEPROM16!F27,2)","v":"00"}]
[null,45,43.4027777777778,2604,null,null,null,null,null,null,null,null,null,null,null,null,null,null,null,{"$f":"DEC2HEX(EEPROM16!G27,2)","v":"00"}]
[null,46,42.4592391304348,2547,null,null,null,null,null,null,null,null,null,null,null,null,null,null,null,{"$f":"DEC2HEX(EEPROM16!H27,2)","v":"00"}]
[null,47,41.5558510638298,2493,null,null,null,null,null,null,null,null,null,null,null,null,null,null,null,{"$f":"DEC2HEX(EEPROM16!I27,2)","v":"00"}]
[null,48,40.6901041666667,2441,null,null,null,null,null,null,null,null,null,null,null,null,null,null,null,{"$f":"DEC2HEX(EEPROM16!J27,2)","v":"00"}]
[null,49,39.859693877551,2391,null,null,null,null,null,null,null,null,null,null,null,null,null,null,null,{"$f":"DEC2HEX(EEPROM16!K27,2)","v":"00"}]
[null,50,39.0625,2343,null,null,null,null,null,null,null,null,null,null,null,null,null,null,null,{"$f":"DEC2HEX(EEPROM16!L27,2)","v":"00"}]
[null,51,38.296568627451,2297,null,null,null,null,null,null,null,null,null,null,null,null,null,null,"x",{"$f":"DEC2HEX(EEPROM16!M27,2)","v":"00"}]
[null,52,37.5600961538462,2253,null,null,null,null,null,null,null,null,null,null,null,null,null,null,null,{"$f":"DEC2HEX(EEPROM16!F28,2)","v":"00"}]
[null,53,36.8514150943396,2211,null,null,null,null,null,null,null,null,null,null,null,null,null,null,null,{"$f":"DEC2HEX(EEPROM16!G28,2)","v":"00"}]
[null,54,36.1689814814815,2170,null,null,null,null,null,null,null,null,null,null,null,null,null,null,null,{"$f":"DEC2HEX(EEPROM16!H28,2)","v":"00"}]
[null,{"$f":"IFERROR(B49,\"\")","v":55},35.5113636363636,2130,null,null,null,null,null,null,null,null,null,null,null,null,null,null,null,{"$f":"DEC2HEX(EEPROM16!I28,2)","v":"00"}]
[null,56,34.8772321428571,2092,null,null,null,null,null,null,null,null,null,null,null,null,null,null,null,{"$f":"DEC2HEX(EEPROM16!J28,2)","v":"00"}]
[null,57,34.265350877193,2055,null,null,null,null,null,null,null,null,null,null,null,null,null,null,null,{"$f":"DEC2HEX(EEPROM16!K28,2)","v":"00"}]
[null,58,33.6745689655172,2020,null,null,null,null,null,null,null,null,null,null,null,null,null,null,null,{"$f":"DEC2HEX(EEPROM16!L28,2)","v":"00"}]
[null,59,33.103813559322,1986,null,null,null,null,null,null,null,null,null,null,null,null,null,null,"x",{"$f":"DEC2HEX(EEPROM16!M28,2)","v":"00"}]
[null,60,32.5520833333333,1953,null,null,null,null,null,null,null,null,null,null,null,null,null,null,null,{"$f":"DEC2HEX(EEPROM16!F29,2)","v":"00"}]
[null,61,32.0184426229508,1921,null,null,null,null,null,null,null,null,null,null,null,null,null,null,null,{"$f":"DEC2HEX(EEPROM16!G29,2)","v":"00"}]
[null,62,31.5020161290323,1890,null,null,null,null,null,null,null,null,null,null,null,null,null,null,null,{"$f":"DEC2HEX(EEPROM16!H29,2)","v":"00"}]
[null,63,31.0019841269841,1860,null,null,null,null,null,null,null,null,null,null,null,null,null,null,null,{"$f":"DEC2HEX(EEPROM16!I29,2)","v":"00"}]
[null,64,30.517578125,1831,null,null,null,null,null,null,null,null,null,null,null,null,null,null,null,{"$f":"DEC2HEX(EEPROM16!J29,2)","v":"00"}]
[null,65,30.0480769230769,1802,null,null,null,null,null,null,null,null,null,null,null,null,null,null,null,{"$f":"DEC2HEX(EEPROM16!K29,2)","v":"00"}]
[null,66,29.592803030303,1775,null,null,null,null,null,null,null,null,null,null,null,null,null,null,null,{"$f":"DEC2HEX(EEPROM16!L29,2)","v":"00"}]
[null,67,29.1511194029851,1749,null,null,null,null,null,null,null,null,null,null,null,null,null,null,"x",{"$f":"DEC2HEX(EEPROM16!M29,2)","v":"00"}]
[null,68,28.7224264705882,1723,null,null,null,null,null,null,null,null,null,null,null,null,null,null,null,{"$f":"DEC2HEX(EEPROM16!F30,2)","v":"00"}]
[null,69,28.3061594202899,1698,null,null,null,null,null,null,null,null,null,null,null,null,null,null,null,{"$f":"DEC2HEX(EEPROM16!G30,2)","v":"00"}]
[null,70,27.9017857142857,1674,null,null,null,null,null,null,null,null,null,null,null,null,null,null,null,{"$f":"DEC2HEX(EEPROM16!H30,2)","v":"00"}]
[null,71,27.5088028169014,1650,null,null,null,null,null,null,null,null,null,null,null,null,null,null,null,{"$f":"DEC2HEX(EEPROM16!I30,2)","v":"00"}]
[null,72,27.1267361111111,1627,null,null,null,null,null,null,null,null,null,null,null,null,null,null,null,{"$f":"DEC2HEX(EEPROM16!J30,2)","v":"00"}]
[null,73,26.7551369863014,1605,null,null,null,null,null,null,null,null,null,null,null,null,null,null,null,{"$f":"DEC2HEX(EEPROM16!K30,2)","v":"00"}]
[null,74,26.3935810810811,1583,null,null,null,null,null,null,null,null,null,null,null,null,null,null,null,{"$f":"DEC2HEX(EEPROM16!L30,2)","v":"00"}]
[null,{"$f":"IFERROR(B69,\"\")","v":75},26.0416666666667,1562,null,null,null,null,null,null,null,null,null,null,null,null,null,null,"x",{"$f":"DEC2HEX(EEPROM16!M30,2)","v":"00"}]
[null,76,25.6990131578947,1541,null,null,null,null,null,null,null,null,null,null,null,null,null,null,null,{"$f":"DEC2HEX(EEPROM16!F31,2)","v":"00"}]
[null,77,25.3652597402597,1521,null,null,null,null,null,null,null,null,null,null,null,null,null,null,null,{"$f":"DEC2HEX(EEPROM16!G31,2)","v":"00"}]
[null,78,25.0400641025641,1502,null,null,null,null,null,null,null,null,null,null,null,null,null,null,null,{"$f":"DEC2HEX(EEPROM16!H31,2)","v":"00"}]
[null,79,24.7231012658228,1483,null,null,null,null,null,null,null,null,null,null,null,null,null,null,null,{"$f":"DEC2HEX(EEPROM16!I31,2)","v":"00"}]
[null,80,24.4140625,1464,null,null,null,null,null,null,null,null,null,null,null,null,null,null,null,{"$f":"DEC2HEX(EEPROM16!J31,2)","v":"00"}]
[null,81,24.1126543209877,1446,null,null,null,null,null,null,null,null,null,null,null,null,null,null,null,{"$f":"DEC2HEX(EEPROM16!K31,2)","v":"00"}]
[null,82,23.8185975609756,1429,null,null,null,null,null,null,null,null,null,null,null,null,null,null,null,{"$f":"DEC2HEX(EEPROM16!L31,2)","v":"00"}]
[null,83,23.5316265060241,1411,null,null,null,null,null,null,null,null,null,null,null,null,null,null,"x",{"$f":"DEC2HEX(EEPROM16!M31,2)","v":"00"}]
[null,84,23.2514880952381,1395,null,null,null,null,null,null,null,null,null,null,null,null,null,null,null,{"$f":"DEC2HEX(EEPROM16!F32,2)","v":"00"}]
[null,85,22.9779411764706,1378,null,null,null,null,null,null,null,null,null,null,null,null,null,null,null,{"$f":"DEC2HEX(EEPROM16!G32,2)","v":"00"}]
[null,86,22.7107558139535,1362,null,null,null,null,null,null,null,null,null,null,null,null,null,null,null,{"$f":"DEC2HEX(EEPROM16!H32,2)","v":"00"}]
[null,87,22.4497126436782,1346,null,null,null,null,null,null,null,null,null,null,null,null,null,null,null,{"$f":"DEC2HEX(EEPROM16!I32,2)","v":"00"}]
[null,88,22.1946022727273,1331,null,null,null,null,null,null,null,null,null,null,null,null,null,null,null,{"$f":"DEC2HEX(EEPROM16!J32,2)","v":"00"}]
[null,89,21.9452247191011,1316,null,null,null,null,null,null,null,null,null,null,null,null,null,null,null,{"$f":"DEC2HEX(EEPROM16!K32,2)","v":"00"}]
[null,90,21.7013888888889,1302,null,null,null,null,null,null,null,null,null,null,null,null,null,null,null,{"$f":"DEC2HEX(EEPROM16!L32,2)","v":"00"}]
[null,91,21.4629120879121,1287,null,null,null,null,null,null,null,null,null,null,null,null,null,null,"x",{"$f":"DEC2HEX(EEPROM16!M32,2)","v":"00"}]
[null,92,21.2296195652174,1273,null,null,null,null,null,null,null,null,null,null,null,null,null,null,null,{"$f":"DEC2HEX(EEPROM16!F33,2)","v":"4F"}]
[null,93,21.0013440860215,1260,null,null,null,null,null,null,null,null,null,null,null,null,null,null,null,{"$f":"DEC2HEX(EEPROM16!G33,2)","v":"19"}]
[null,94,20.7779255319149,1246,null,null,null,null,null,null,null,null,null,null,null,null,null,null,null,{"$f":"DEC2HEX(EEPROM16!H33,2)","v":"01"}]
[null,{"$f":"IFERROR(B89,\"\")","v":95},20.5592105263158,1233,null,null,null,null,null,null,null,null,null,null,null,null,null,null,null,{"$f":"DEC2HEX(EEPROM16!I33,2)","v":"00"}]
[null,96,20.3450520833333,1220,null,null,null,null,null,null,null,null,null,null,null,null,null,null,null,{"$f":"DEC2HEX(EEPROM16!J33,2)","v":"00"}]
[null,97,20.1353092783505,1208,null,null,null,null,null,null,null,null,null,null,null,null,null,null,null,{"$f":"DEC2HEX(EEPROM16!K33,2)","v":"00"}]
[null,98,19.9298469387755,1195,null,null,null,null,null,null,null,null,null,null,null,null,null,null,null,{"$f":"DEC2HEX(EEPROM16!L33,2)","v":"00"}]
[null,99,19.7285353535354,1183,null,null,null,null,null,null,null,null,null,null,null,null,null,null,"x",{"$f":"DEC2HEX(EEPROM16!M33,2)","v":"00"}]
[null,100,19.53125,1171,null,null,null,null,null,null,null,null,null,null,null,null,null,null,null,{"$f":"DEC2HEX(EEPROM16!F34,2)","v":"A0"}]
[null,101,19.3378712871287,1160,null,null,null,null,null,null,null,null,null,null,null,null,null,null,null,{"$f":"DEC2HEX(EEPROM16!G34,2)","v":"00"}]
[null,102,19.1482843137255,1148,null,null,null,null,null,null,null,null,null,null,null,null,null,null,null,{"$f":"DEC2HEX(EEPROM16!H34,2)","v":"4B"}]
[null,103,18.9623786407767,1137,null,null,null,null,null,null,null,null,null,null,null,null,null,null,null,{"$f":"DEC2HEX(EEPROM16!I34,2)","v":"01"}]
[null,104,18.7800480769231,1126,null,null,null,null,null,null,null,null,null,null,null,null,null,null,null,{"$f":"DEC2HEX(EEPROM16!J34,2)","v":"C8"}]
[null,105,18.6011904761905,1116,null,null,null,null,null,null,null,null,null,null,null,null,null,null,null,{"$f":"DEC2HEX(EEPROM16!K34,2)","v":"01"}]
[null,106,18.4257075471698,1105,null,null,null,null,null,null,null,null,null,null,null,null,null,null,null,{"$f":"DEC2HEX(EEPROM16!L34,2)","v":"01"}]
[null,107,18.2535046728972,1095,null,null,null,null,null,null,null,null,null,null,null,null,null,null,"x",{"$f":"DEC2HEX(EEPROM16!M34,2)","v":"00"}]
[null,108,18.0844907407407,1085,null,null,null,null,null,null,null,null,null,null,null,null,null,null,null,{"$f":"DEC2HEX(EEPROM16!F35,2)","v":"5C"}]
[null,109,17.9185779816514,1075,null,null,null,null,null,null,null,null,null,null,null,null,null,null,null,{"$f":"DEC2HEX(EEPROM16!G35,2)","v":"1E"}]
[null,110,17.7556818181818,1065,null,null,null,null,null,null,null,null,null,null,null,null,null,null,null,{"$f":"DEC2HEX(EEPROM16!H35,2)","v":"63"}]
[null,111,17.5957207207207,1055,null,null,null,null,null,null,null,null,null,null,null,null,null,null,null,{"$f":"DEC2HEX(EEPROM16!I35,2)","v":"08"}]
[null,112,17.4386160714286,1046,null,null,null,null,null,null,null,null,null,null,null,null,null,null,null,{"$f":"DEC2HEX(EEPROM16!J35,2)","v":"00"}]
[null,113,17.2842920353982,1037,null,null,null,null,null,null,null,null,null,null,null,null,null,null,null,{"$f":"DEC2HEX(EEPROM16!K35,2)","v":"28"}]
[null,114,17.1326754385965,1027,null,null,null,null,null,null,null,null,null,null,null,null,null,null,null,{"$f":"DEC2HEX(EEPROM16!L35,2)","v":"0F"}]
[null,{"$f":"IFERROR(B109,\"\")","v":115},16.9836956521739,1019,null,null,null,null,null,null,null,null,null,null,null,null,null,null,"x",{"$f":"DEC2HEX(EEPROM16!M35,2)","v":"AE"}]
[null,116,16.8372844827586,1010]
[null,117,16.6933760683761,1001]
[null,118,16.551906779661,993]
[null,119,16.4128151260504,984]
[null,120,16.2760416666667,976]
[null,121,16.1415289256198,968]
[null,122,16.0092213114754,960]
[null,123,15.8790650406504,952]
[null,124,15.7510080645161,945]
[null,125,15.625,937]
[null,126,15.5009920634921,930]
[null,127,15.378937007874,922]
[null,128,15.2587890625,915]
[null,129,15.140503875969,908]
[null,130,15.0240384615385,901]
[null,131,14.9093511450382,894]
[null,132,14.7964015151515,887]
[null,133,14.6851503759399,881]
[null,134,14.5755597014925,874]
[null,{"$f":"IFERROR(B129,\"\")","v":135},14.4675925925926,868]
[null,136,14.3612132352941,861]
[null,137,14.2563868613139,855]
[null,138,14.1530797101449,849]
[null,139,14.0512589928058,843]
[null,140,13.9508928571429,837]
[null,141,13.8519503546099,831]
[null,142,13.7544014084507,825]
[null,143,13.6582167832168,819]
[null,144,13.5633680555556,813]
[null,145,13.4698275862069,808]
[null,146,13.3775684931507,802]
[null,147,13.2865646258503,797]
[null,148,13.1967905405405,791]
[null,149,13.1082214765101,786]
[null,150,13.0208333333333,781]
[null,151,12.9346026490066,776]
[null,152,12.8495065789474,770]
[null,153,12.765522875817,765]
[null,154,12.6826298701299,760]
[null,{"$f":"IFERROR(B149,\"\")","v":155},12.6008064516129,756]
[null,156,12.5200320512821,751]
[null,157,12.4402866242038,746]
[null,158,12.3615506329114,741]
[null,159,12.2838050314465,737]
[null,160,12.20703125,732]
[null,161,12.1312111801242,727]
[null,162,12.0563271604938,723]
[null,163,11.9823619631902,718]
[null,164,11.9092987804878,714]
[null,165,11.8371212121212,710]
[null,166,11.765813253012,705]
[null,167,11.6953592814371,701]
[null,168,11.625744047619,697]
[null,169,11.5569526627219,693]
[null,170,11.4889705882353,689]
[null,171,11.421783625731,685]
[null,172,11.3553779069767,681]
[null,173,11.2897398843931,677]
[null,174,11.2248563218391,673]
[null,{"$f":"IFERROR(B169,\"\")","v":"- End -"},"",""]

{"sheet":"LowRPM","index":2,"n_rows":36,"n_cols":26,"rows_kept":36,"cut":false,"hidden":false,"merged":[[0,6,0,7]]}
[]
[null,"Advance at low RPM",null,{"$f":"CONCATENATE(\"from \",L7,\" to\")","v":"from 76 to"},{"$f":"CONCATENATE(ROUNDDOWN(Advance_curve!C7,0),\" RPM\")","v":"673 RPM"},null,null,"VLRPM",92,"us"]
[]
[null,null,null,"Cylinder(s) =",{"$f":"Advance_curve!N24","v":1},null,null,"Fosc/4",{"$f":"Advance_curve!C4","v":4},"MHz","TMR1deb max",{"$f":"48/I5","v":6}]
[null,null,null,"Strokes =",{"$f":"Advance_curve!N25","v":2},"STK",null,"Prescaler",{"$f":"Advance_curve!N30","v":8},null,"durée debords max",{"$f":"L4*I7","v":780.3},"ms"]
[null,null,null,"Pkp position =",{"$f":"Advance_curve!$F$5","v":75},"° BTDC",null,"periode TMR1L",{"$f":"I5/I4","v":2},"ms","Frq mini",{"$f":"1000/L5","v":1.28155837498398},"Hz","Frq",null,"periode","periode","1°","Timer1","TMR1h","TMR1deb","TMR1rest","Delay","Delay needed","Delay","advance"]
[null,null,null,"RPM limit =",{"$f":"IF(Advance_curve!N30=1,\"336\",IF(Advance_curve!N30=2,\"168\",IF(Advance_curve!N30=4,\"84\",IF(Advance_curve!N30=8,\"42\",\"False\"))))","v":"42"},"RPM",null,"débord TMR1H",{"$f":"255*255*I6/1000","v":130.05},"ms","RPM mini",{"$f":"INT(60*L6*E5/2*E4)","v":76},"RPM","Hz","RPM","µs","ms","us",null,null,null,null,"µs","µs","degres","degres BTDC"]
[null,null,null,null,null,null,null,null,null,null,null,null,null,1,{"$f":"IF(N8=\"End\",\" \",(N8*60*$E$5)/(2*$E$4))","v":60},{"$f":"1000000/N8","v":1000000},{"$f":"P8/1000","v":1000},{"$f":"((1000*1000*60)/($E$4*O8))/360","v":2777.77777777778},{"$f":"IF(N8=\"End\",\" \",INT(P8*Advance_curve!$C$4)/$I$5)","v":500000},{"$f":"IF(N8=\"End\",\" \",S8/255)","v":1960.78431372549},{"$f":"INT(T8/255)","v":7},{"$f":"T8-U8*255","v":175.78431372549},{"$f":"IF(U8<6,(U8*255*$I$2)+(V8*($I$2+0)),$I$2*(5*255+V8))","v":133472.156862745},{"$f":"W8","v":133472.156862745},{"$f":"X8/R8","v":48.0499764705882},{"$f":"$E$6-Y8","v":26.9500235294118}]
[null,null,null,null,null,null,null,"temps calcul",22,"µs",null,null,null,1.5,{"$f":"IF(N9=\"End\",\" \",(N9*60*$E$5)/(2*$E$4))","v":90},{"$f":"1000000/N9","v":666666.666666667},{"$f":"P9/1000","v":666.666666666667},{"$f":"((1000*1000*60)/($E$4*O9))/360","v":1851.85185185185},{"$f":"IF(N9=\"End\",\" \",INT(P9*Advance_curve!$C$4)/$I$5)","v":333333.25},{"$f":"IF(N9=\"End\",\" \",S9/255)","v":1307.18921568627},{"$f":"INT(T9/255)","v":5},{"$f":"T9-U9*255","v":32.1892156862746},120261.407843137,{"$f":"W9","v":120261.407843137},{"$f":"X9/R9","v":64.9411602352942},{"$f":"$E$6-Y9","v":10.0588397647058}]
[null,null,null,null,null,null,null,"hysteresis",{"$f":"Advance_curve!I6","v":200},"µs",null,null,null,{"$f":"IF(N8<Advance_curve!C$6,N8+1,\"End\")","v":2},120,500000,500,{"$f":"((1000*1000*60)/($E$4*O10))/360","v":1388.88888888889},{"$f":"IF(N10=\"End\",\" \",INT(P10*Advance_curve!$C$4)/$I$5)","v":250000},980.392156862745,{"$f":"INT(T10/255)","v":3},{"$f":"T10-U10*255","v":215.392156862745},90196.0784313725,90196.0784313725,{"$f":"X10/R10","v":64.9411764705882},{"$f":"$E$6-Y10","v":10.0588235294118}]
[null,null,null,null,null,null,null,null,null,null,null,null,null,{"$f":"IF(N10<Advance_curve!$C$6,N10+1,\"End\")","v":3},180,333333.333333333,333.333333333333,925.925925925926,{"$f":"IF(N11=\"End\",\" \",INT(P11*Advance_curve!$C$4)/$I$5)","v":166666.625},653.594607843137,2,143.594607843137,60130.7039215686,60130.7039215686,{"$f":"X11/R11","v":64.9411602352941},{"$f":"IF($U11<5,$E$6-Y11,\"0\")","v":10.0588397647059}]
[null,null,null,null,null,null,null,null,null,null,null,null,null,{"$f":"IF(N11<Advance_curve!$C$6,N11+1,\"End\")","v":4},240,250000,250,694.444444444444,{"$f":"IF(N12=\"End\",\" \",INT(P12*Advance_curve!$C$4)/$I$5)","v":125000},490.196078431373,1,235.196078431373,45098.0392156863,45098.0392156863,64.9411764705883,10.0588235294117]
[null,null,null,null,null,null,null,null,null,null,null,null,null,{"$f":"IF(N12<Advance_curve!$C$6,N12+1,\"End\")","v":5},300,200000,200,555.555555555556,{"$f":"IF(N13=\"End\",\" \",INT(P13*Advance_curve!$C$4)/$I$5)","v":100000},392.156862745098,1,137.156862745098,36078.431372549,36078.431372549,64.9411764705882,10.0588235294118]
[null,null,null,null,null,null,null,null,null,null,null,null,null,{"$f":"IF(N13<Advance_curve!$C$6,N13+1,\"End\")","v":6},360,166666.666666667,166.666666666667,462.962962962963,{"$f":"IF(N14=\"End\",\" \",INT(P14*Advance_curve!$C$4)/$I$5)","v":83333.25},326.797058823529,1,71.7970588235294,30065.3294117647,30065.3294117647,64.9411115294118,10.0588884705882]
[null,null,null,null,null,null,null,null,null,null,null,null,null,{"$f":"IF(N14<Advance_curve!$C$6,N14+1,\"End\")","v":7},420,142857.142857143,142.857142857143,396.825396825397,{"$f":"IF(N15=\"End\",\" \",INT(P15*Advance_curve!$C$4)/$I$5)","v":71428.5},280.111764705882,1,25.1117647058824,25770.2823529412,25770.2823529412,64.9411115294117,10.0588884705883]
[null,null,null,null,null,null,null,null,null,null,null,null,null,{"$f":"IF(N15<Advance_curve!$C$6,N15+1,\"End\")","v":8},480,125000,125,347.222222222222,{"$f":"IF(N16=\"End\",\" \",INT(P16*Advance_curve!$C$4)/$I$5)","v":62500},245.098039215686,0,245.098039215686,22549.0196078431,22549.0196078431,64.9411764705882,10.0588235294118]
[null,null,null,null,null,null,null,null,null,null,null,null,null,{"$f":"IF(N16<Advance_curve!$C$6,N16+1,\"End\")","v":9},540,111111.111111111,111.111111111111,308.641975308642,{"$f":"IF(N17=\"End\",\" \",INT(P17*Advance_curve!$C$4)/$I$5)","v":55555.5},217.864705882353,0,217.864705882353,20043.5529411765,20043.5529411765,64.9411115294118,10.0588884705882]
[null,null,null,null,null,null,null,null,null,null,null,null,null,{"$f":"IF(N17<Advance_curve!$C$6,N17+1,\"End\")","v":10},600,100000,100,277.777777777778,{"$f":"IF(N18=\"End\",\" \",INT(P18*Advance_curve!$C$4)/$I$5)","v":50000},196.078431372549,0,196.078431372549,18039.2156862745,18039.2156862745,64.9411764705882,10.0588235294118]
[null,null,null,null,null,null,null,null,null,null,null,null,null,{"$f":"IF(N18<Advance_curve!$C$6,N18+1,\"End\")","v":11},660,90909.0909090909,90.9090909090909,252.525252525253,{"$f":"IF(N19=\"End\",\" \",INT(P19*Advance_curve!$C$4)/$I$5)","v":45454.5},178.252941176471,0,178.252941176471,16399.2705882353,16399.2705882353,64.9411115294118,10.0588884705882]
[null,null,null,null,null,null,null,null,null,null,null,null,null,{"$f":"IF(N19<Advance_curve!$C$6,N19+1,\"End\")","v":12},720,83333.3333333333,83.3333333333333,231.481481481481,{"$f":"IF(N20=\"End\",\" \",INT(P20*Advance_curve!$C$4)/$I$5)","v":41666.625},163.398529411765,{"$f":"INT(T20/255)","v":0},{"$f":"T20-U20*255","v":163.398529411765},15032.6647058824,15032.6647058824,64.941111529412,{"$f":"IF($T20<255,Advance_curve!$F$5-Y20,\"0\")","v":10.058888470588}]
[null,null,null,null,null,null,null,null,null,null,null,null,null,{"$f":"IF(N20<Advance_curve!$C$6,N20+1,\"End\")","v":"End"}," ",{"$error":"#VALUE!"},{"$error":"#VALUE!"},{"$error":"#VALUE!"},{"$f":"IF(N21=\"End\",\" \",INT(P21*Advance_curve!$C$4)/$I$5)","v":" "}," ",{"$error":"#VALUE!"},{"$error":"#VALUE!"},{"$error":"#VALUE!"},{"$error":"#VALUE!"},{"$error":"#VALUE!"},{"$f":"IF($T21<255,Advance_curve!$F$5-Y21,\"0\")","v":"0"}]
[null,null,null,null,null,null,null,null,null,null,null,null,null,{"$f":"IF(N21<Advance_curve!$C$6,N21+1,\"End\")","v":"End"}," ",{"$error":"#VALUE!"},{"$error":"#VALUE!"},{"$error":"#VALUE!"},{"$f":"IF(N22=\"End\",\" \",INT(P22*Advance_curve!$C$4)/$I$5)","v":" "}," ",{"$error":"#VALUE!"},{"$error":"#VALUE!"},{"$error":"#VALUE!"},{"$error":"#VALUE!"},{"$error":"#VALUE!"},{"$f":"IF($T22<255,Advance_curve!$F$5-Y22,\"0\")","v":"0"}]
[null,null,null,null,null,null,null,null,null,null,null,null,null,{"$f":"IF(N22<Advance_curve!$C$6,N22+1,\"End\")","v":"End"}," ",{"$error":"#VALUE!"},{"$error":"#VALUE!"},{"$error":"#VALUE!"},{"$f":"IF(N23=\"End\",\" \",INT(P23*Advance_curve!$C$4)/$I$5)","v":" "}," ",{"$error":"#VALUE!"},{"$error":"#VALUE!"},{"$error":"#VALUE!"},{"$error":"#VALUE!"},{"$error":"#VALUE!"},{"$f":"IF($T23<255,Advance_curve!$F$5-Y23,\"0\")","v":"0"}]
[null,null,null,null,null,null,null,null,null,null,null,null,null,{"$f":"IF(N23<Advance_curve!$C$6,N23+1,\"End\")","v":"End"}," ",{"$error":"#VALUE!"},{"$error":"#VALUE!"},{"$error":"#VALUE!"},{"$f":"IF(N24=\"End\",\" \",INT(P24*Advance_curve!$C$4)/$I$5)","v":" "}," ",{"$error":"#VALUE!"},{"$error":"#VALUE!"},{"$error":"#VALUE!"},{"$error":"#VALUE!"},{"$error":"#VALUE!"},{"$f":"IF($T24<255,Advance_curve!$F$5-Y24,\"0\")","v":"0"}]
[null,null,null,null,null,null,null,null,null,null,null,null,null,{"$f":"IF(N24<Advance_curve!$C$6,N24+1,\"End\")","v":"End"}," ",{"$error":"#VALUE!"},{"$error":"#VALUE!"},{"$error":"#VALUE!"},{"$f":"IF(N25=\"End\",\" \",INT(P25*Advance_curve!$C$4)/$I$5)","v":" "}," ",{"$error":"#VALUE!"},{"$error":"#VALUE!"},{"$error":"#VALUE!"},{"$error":"#VALUE!"},{"$error":"#VALUE!"},{"$f":"IF($T25<255,Advance_curve!$F$5-Y25,\"0\")","v":"0"}]
[null,null,null,null,null,null,null,null,null,null,null,null,null,{"$f":"IF(N25<Advance_curve!$C$6,N25+1,\"End\")","v":"End"}," ",{"$error":"#VALUE!"},{"$error":"#VALUE!"},{"$error":"#VALUE!"},{"$f":"IF(N26=\"End\",\" \",INT(P26*Advance_curve!$C$4)/$I$5)","v":" "},{"$f":"IF(N26=\"End\",\" \",S26/255)","v":" "},{"$error":"#VALUE!"},{"$error":"#VALUE!"},{"$error":"#VALUE!"},{"$error":"#VALUE!"},{"$error":"#VALUE!"},{"$f":"IF($T26<255,Advance_curve!$F$5-Y26,\"0\")","v":"0"}]
[]
[]
[]
[null,null,null,null,null,null,null,"Délai proportionnel aux nbr de débords."]
[]
[null,null,null,null,null,null,null,"Avec Clock 16MHz:"]
[null,null,null,null,null,null,null,"PRESC=1 => TMR1H s'incrémente de 1 en  64us et déborde en 16ms"]
[null,null,null,null,null,null,null,"PRESC=2 => TMR1H s'incrémente de 1 en 128us et déborde en 32ms <==="]
[null,null,null,null,null,null,null,"PRESC=4 => TMR1H s'incrémente de 1 en 256us et déborde en 65ms"]
[null,null,null,null,null,null,null,"PRESC=8 => TMR1H s'incrémente de 1 en 512us et déborde en 131ms"]

{"sheet":"EEPROM16","index":3,"n_rows":81,"n_cols":24,"rows_kept":81,"cut":false,"hidden":false,"merged":[]}
[null,null,null,null,null,null,null,null,null,null,null,null,null,null,"INTEL 16HEX format",null,"RAW format"]
[null,null,null,null,null,null,null,null,null,null,null,null,null,null,":020000040000FA",null,null,null,null,null,null,null,null,"Hash"]
["Bytes\n in Row","Address MSB (hex)","Address LSB (hex)","Address Start (MSB)","Address\nStart\n(LSB)","+0","+1","+2","+3","+4","+5","+6","+7",null,":020000040001F9",null,null,null,"sum[dec]","sum[hex]","LSB","two's\ncomplement [dec]","two's\ncomplement +1","cksum"]
[16,"E0",{"$f":"DEC2HEX(E4,2)","v":"00"},224,0,{"$f":"ROUND(Advance_curve!$K9,0)","v":18},{"$f":"ROUND(Advance_curve!$K10,0)","v":19},{"$f":"ROUND(Advance_curve!$K11,0)","v":21},{"$f":"ROUND(Advance_curve!$K12,0)","v":23},{"$f":"ROUND(Advance_curve!$K13,0)","v":24},{"$f":"ROUND(Advance_curve!$K14,0)","v":26},{"$f":"ROUND(Advance_curve!$K15,0)","v":28},{"$f":"ROUND(Advance_curve!$K16,0)","v":29},null,{"$f":"\":\"&DEC2HEX(A4,2)&B4&C4&\"00\"&DEC2HEX(F4,2)&\"00\"&DEC2HEX(G4,2)&\"00\"&DEC2HEX(H4,2)&\"00\"&DEC2HEX(I4,2)&\"00\"&DEC2HEX(J4,2)&\"00\"&DEC2HEX(K4,2)&\"00\"&DEC2HEX(L4,2)&\"00\"&DEC2HEX(M4,2)&\"00\"&X4","v":":10E00000120013001500170018001A001C001D0054"},null,{"$f":"DEC2HEX(F4,2)&\" \"&DEC2HEX(G4,2)&\" \"&DEC2HEX(H4,2)&\" \"&DEC2HEX(I4,2)&\"   \"&DEC2HEX(J4,2)&\" \"&DEC2HEX(K4,2)&\" \"&DEC2HEX(L4,2)&\" \"&DEC2HEX(M4,2)","v":"12 13 15 17   18 1A 1C 1D"},null,{"$f":"SUM(A4,D4:M4)","v":428},{"$f":"DEC2HEX(S4)","v":"1AC"},{"$f":"RIGHT(T4,2)","v":"AC"},{"$f":"255-HEX2DEC(U4)","v":83},{"$f":"V4+1","v":84},{"$f":"IF(W4=256,\"00\",DEC2HEX(W4,2))","v":"54"}]
[16,"E0","10",224,16,{"$f":"ROUND(Advance_curve!$K17,0)","v":31},{"$f":"ROUND(Advance_curve!$K18,0)","v":33},{"$f":"ROUND(Advance_curve!$K19,0)","v":34},{"$f":"ROUND(Advance_curve!$K20,0)","v":36},{"$f":"ROUND(Advance_curve!$K21,0)","v":38},{"$f":"ROUND(Advance_curve!$K22,0)","v":40},{"$f":"ROUND(Advance_curve!$K23,0)","v":42},{"$f":"ROUND(Advance_curve!K24,0)","v":44},null,":10E010001F00210022002400260028002A002C00D6",null,"1F 21 22 24   26 28 2A 2C",null,554,"22A","2A",213,214,"D6"]
[16,"E0","20",224,32,{"$f":"ROUND(Advance_curve!$K25,0)","v":46},{"$f":"ROUND(Advance_curve!$K26,0)","v":48},{"$f":"ROUND(Advance_curve!$K27,0)","v":50},{"$f":"ROUND(Advance_curve!$K28,0)","v":52},{"$f":"ROUND(Advance_curve!$K29,0)","v":55},{"$f":"ROUND(Advance_curve!$K30,0)","v":58},{"$f":"ROUND(Advance_curve!$K31,0)","v":61},{"$f":"ROUND(Advance_curve!$K32,0)","v":64},null,":10E020002E0030003200340037003A003D0040003E",null,"2E 30 32 34   37 3A 3D 40",null,706,"2C2","C2",61,62,"3E"]
[16,"E0","30",224,48,{"$f":"ROUND(Advance_curve!$K33,0)","v":67},{"$f":"ROUND(Advance_curve!$K34,0)","v":70},{"$f":"ROUND(Advance_curve!$K35,0)","v":73},{"$f":"ROUND(Advance_curve!$K36,0)","v":76},{"$f":"ROUND(Advance_curve!$K37,0)","v":79},{"$f":"ROUND(Advance_curve!$K38,0)","v":82},{"$f":"ROUND(Advance_curve!$K39,0)","v":85},{"$f":"ROUND(Advance_curve!$K40,0)","v":88},null,":10E030004300460049004C004F0052005500580074",null,"43 46 49 4C   4F 52 55 58",null,908,"38C","8C",115,116,"74"]
[16,"E0","40",224,64,{"$f":"ROUND(Advance_curve!$K41,0)","v":91},{"$f":"ROUND(Advance_curve!$K42,0)","v":94},{"$f":"ROUND(Advance_curve!$K43,0)","v":97},{"$f":"ROUND(Advance_curve!$K44,0)","v":100},{"$f":"ROUND(Advance_curve!$K45,0)","v":103},{"$f":"ROUND(Advance_curve!$K46,0)","v":106},{"$f":"ROUND(Advance_curve!$K47,0)","v":108},{"$f":"ROUND(Advance_curve!$K48,0)","v":111},null,":10E040005B005E006100640067006A006C006F00A6",null,"5B 5E 61 64   67 6A 6C 6F",null,1114,"45A","5A",165,166,"A6"]
[16,"E0","50",224,80,{"$f":"ROUND(Advance_curve!$K49,0)","v":114},{"$f":"ROUND(Advance_curve!$K50,0)","v":117},{"$f":"ROUND(Advance_curve!$K51,0)","v":119},{"$f":"ROUND(Advance_curve!$K52,0)","v":122},{"$f":"ROUND(Advance_curve!$K53,0)","v":125},{"$f":"ROUND(Advance_curve!$K54,0)","v":127},{"$f":"ROUND(Advance_curve!$K55,0)","v":130},{"$f":"ROUND(Advance_curve!$K56,0)","v":133},null,":10E050007200750077007A007D007F0082008500E5",null,"72 75 77 7A   7D 7F 82 85",null,1307,"51B","1B",228,229,"E5"]
[16,"E0","60",224,96,{"$f":"ROUND(Advance_curve!$K57,0)","v":135},{"$f":"ROUND(Advance_curve!$K58,0)","v":138},{"$f":"ROUND(Advance_curve!$K59,0)","v":141},{"$f":"ROUND(Advance_curve!$K60,0)","v":143},{"$f":"ROUND(Advance_curve!$K61,0)","v":146},{"$f":"ROUND(Advance_curve!$K62,0)","v":148},{"$f":"ROUND(Advance_curve!$K63,0)","v":151},{"$f":"ROUND(Advance_curve!$K64,0)","v":154},null,":10E0600087008A008D008F009200940097009A002C",null,"87 8A 8D 8F   92 94 97 9A",null,1492,"5D4","D4",43,44,"2C"]
[16,"E0","70",224,112,{"$f":"ROUND(Advance_curve!$K65,0)","v":156},{"$f":"ROUND(Advance_curve!$K66,0)","v":159},{"$f":"ROUND(Advance_curve!$K67,0)","v":161},{"$f":"ROUND(Advance_curve!$K68,0)","v":164},{"$f":"ROUND(Advance_curve!$K69,0)","v":166},{"$f":"ROUND(Advance_curve!$K70,0)","v":169},{"$f":"ROUND(Advance_curve!$K71,0)","v":171},{"$f":"ROUND(Advance_curve!$K72,0)","v":174},null,":10E070009C009F00A100A400A600A900AB00AE0078",null,"9C 9F A1 A4   A6 A9 AB AE",null,1672,"688","88",119,120,"78"]
[16,"E0","80",224,128,{"$f":"ROUND(Advance_curve!$K73,0)","v":176},{"$f":"ROUND(Advance_curve!$K74,0)","v":179},{"$f":"ROUND(Advance_curve!$K75,0)","v":181},{"$f":"ROUND(Advance_curve!$K76,0)","v":183},{"$f":"ROUND(Advance_curve!$K77,0)","v":186},{"$f":"ROUND(Advance_curve!$K78,0)","v":188},{"$f":"ROUND(Advance_curve!$K79,0)","v":190},{"$f":"ROUND(Advance_curve!$K80,0)","v":193},null,":10E08000B000B300B500B700BA00BC00BE00C100CC",null,"B0 B3 B5 B7   BA BC BE C1",null,1844,"734","34",203,204,"CC"]
[16,"E0","90",224,144,{"$f":"ROUND(Advance_curve!$K81,0)","v":195},{"$f":"ROUND(Advance_curve!$K82,0)","v":197},{"$f":"ROUND(Advance_curve!$K83,0)","v":200},{"$f":"ROUND(Advance_curve!$K84,0)","v":202},{"$f":"ROUND(Advance_curve!$K85,0)","v":204},{"$f":"ROUND(Advance_curve!$K86,0)","v":207},{"$f":"ROUND(Advance_curve!$K87,0)","v":209},{"$f":"ROUND(Advance_curve!$K88,0)","v":211},null,":10E09000C300C500C800CA00CC00CF00D100D30027",null,"C3 C5 C8 CA   CC CF D1 D3",null,2009,"7D9","D9",38,39,"27"]
[16,"E0","A0",224,160,{"$f":"ROUND(Advance_curve!$K89,0)","v":85},{"$f":"ROUND(Advance_curve!$K90,0)","v":86},{"$f":"ROUND(Advance_curve!$K91,0)","v":87},{"$f":"ROUND(Advance_curve!$K92,0)","v":88},{"$f":"ROUND(Advance_curve!$K93,0)","v":89},{"$f":"ROUND(Advance_curve!$K94,0)","v":90},{"$f":"ROUND(Advance_curve!$K95,0)","v":91},{"$f":"ROUND(Advance_curve!$K96,0)","v":92},null,":10E0A000550056005700580059005A005B005C00AC",null,"55 56 57 58   59 5A 5B 5C",null,1108,"454","54",171,172,"AC"]
[16,"E0","B0",224,176,{"$f":"ROUND(Advance_curve!K97,0)","v":93},{"$f":"ROUND(Advance_curve!K98,0)","v":93},{"$f":"ROUND(Advance_curve!K99,0)","v":94},{"$f":"ROUND(Advance_curve!K100,0)","v":95},{"$f":"ROUND(Advance_curve!K101,0)","v":96},{"$f":"ROUND(Advance_curve!K102,0)","v":97},{"$f":"ROUND(Advance_curve!K103,0)","v":98},{"$f":"ROUND(Advance_curve!K104,0)","v":99},null,":10E0B0005D005D005E005F00600061006200630063",null,"5D 5D 5E 5F   60 61 62 63",null,1181,"49D","9D",98,99,"63"]
[16,"E0","C0",224,192,{"$f":"ROUND(Advance_curve!$K105,0)","v":100},{"$f":"ROUND(Advance_curve!$K106,0)","v":101},{"$f":"ROUND(Advance_curve!$K107,0)","v":102},{"$f":"ROUND(Advance_curve!$K108,0)","v":103},{"$f":"ROUND(Advance_curve!$K109,0)","v":104},{"$f":"ROUND(Advance_curve!$K110,0)","v":105},{"$f":"ROUND(Advance_curve!$K111,0)","v":105},{"$f":"ROUND(Advance_curve!$K112,0)","v":106},null,":10E0C00064006500660067006800690069006A0016",null,"64 65 66 67   68 69 69 6A",null,1258,"4EA","EA",21,22,"16"]
[16,"E0","D0",224,208,{"$f":"ROUND(Advance_curve!$K113,0)","v":107},{"$f":"ROUND(Advance_curve!$K114,0)","v":108},{"$f":"ROUND(Advance_curve!$K115,0)","v":109},{"$f":"ROUND(Advance_curve!$K116,0)","v":110},{"$f":"ROUND(Advance_curve!$K117,0)","v":111},{"$f":"ROUND(Advance_curve!$K118,0)","v":112},{"$f":"ROUND(Advance_curve!$K119,0)","v":113},{"$f":"ROUND(Advance_curve!$K120,0)","v":114},null,{"$f":"\":\"&DEC2HEX(A17,2)&B17&C17&\"00\"&DEC2HEX(F17,2)&\"00\"&DEC2HEX(G17,2)&\"00\"&DEC2HEX(H17,2)&\"00\"&DEC2HEX(I17,2)&\"00\"&DEC2HEX(J17,2)&\"00\"&DEC2HEX(K17,2)&\"00\"&DEC2HEX(L17,2)&\"00\"&DEC2HEX(M17,2)&\"00\"&X17","v":":10E0D0006B006C006D006E006F00700071007200CC"},null,"6B 6C 6D 6E   6F 70 71 72",null,1332,"534","34",203,204,"CC"]
[16,"E0","E0",224,224,{"$f":"ROUND(Advance_curve!$K121,0)","v":115},{"$f":"ROUND(Advance_curve!$K122,0)","v":116},{"$f":"ROUND(Advance_curve!$K123,0)","v":117},{"$f":"ROUND(Advance_curve!$K124,0)","v":117},{"$f":"ROUND(Advance_curve!$K125,0)","v":118},{"$f":"ROUND(Advance_curve!$K126,0)","v":119},{"$f":"ROUND(Advance_curve!$K127,0)","v":120},{"$f":"ROUND(Advance_curve!$K128,0)","v":121},null,":10E0E0007300740075007500760077007800790081",null,"73 74 75 75   76 77 78 79",null,1407,"57F","7F",128,129,"81"]
[16,"E0","F0",224,240,{"$f":"ROUND(Advance_curve!$K129,0)","v":122},{"$f":"ROUND(Advance_curve!$K130,0)","v":123},{"$f":"ROUND(Advance_curve!$K131,0)","v":124},{"$f":"ROUND(Advance_curve!$K132,0)","v":125},{"$f":"ROUND(Advance_curve!$K133,0)","v":126},{"$f":"ROUND(Advance_curve!$K134,0)","v":127},{"$f":"ROUND(Advance_curve!$K135,0)","v":128},{"$f":"ROUND(Advance_curve!$K136,0)","v":129},null,":10E0F0007A007B007C007D007E007F008000810034",null,"7A 7B 7C 7D   7E 7F 80 81",null,1484,"5CC","CC",51,52,"34"]
[16,"E1",{"$f":"DEC2HEX(E20,2)","v":"00"},225,0,{"$f":"ROUND(Advance_curve!$K137,0)","v":130},{"$f":"ROUND(Advance_curve!$K138,0)","v":130},{"$f":"ROUND(Advance_curve!$K139,0)","v":131},{"$f":"ROUND(Advance_curve!$K140,0)","v":132},{"$f":"ROUND(Advance_curve!$K141,0)","v":133},{"$f":"ROUND(Advance_curve!$K142,0)","v":134},{"$f":"ROUND(Advance_curve!$K143,0)","v":135},{"$f":"ROUND(Advance_curve!$K144,0)","v":136},null,":10E1000082008200830084008500860087008800EA",null,"82 82 83 84   85 86 87 88",null,1302,"516","16",233,234,"EA"]
[16,"E1","10",225,16,{"$f":"ROUND(Advance_curve!$K145,0)","v":137},{"$f":"ROUND(Advance_curve!$K146,0)","v":138},{"$f":"ROUND(Advance_curve!$K147,0)","v":139},{"$f":"ROUND(Advance_curve!$K148,0)","v":140},{"$f":"ROUND(Advance_curve!$K149,0)","v":141},{"$f":"ROUND(Advance_curve!$K150,0)","v":141},{"$f":"ROUND(Advance_curve!$K151,0)","v":142},{"$f":"ROUND(Advance_curve!$K152,0)","v":143},null,":10E1100089008A008B008C008D008D008E008F009E",null,"89 8A 8B 8C   8D 8D 8E 8F",null,1378,"562","62",157,158,"9E"]
[16,"E1","20",225,32,{"$f":"ROUND(Advance_curve!$K153,0)","v":144},{"$f":"ROUND(Advance_curve!$K154,0)","v":145},{"$f":"ROUND(Advance_curve!$K155,0)","v":146},{"$f":"ROUND(Advance_curve!$K156,0)","v":147},{"$f":"ROUND(Advance_curve!$K157,0)","v":148},{"$f":"ROUND(Advance_curve!$K158,0)","v":149},{"$f":"ROUND(Advance_curve!$K159,0)","v":150},{"$f":"ROUND(Advance_curve!$K160,0)","v":151},null,":10E120009000910092009300940095009600970053",null,"90 91 92 93   94 95 96 97",null,1453,"5AD","AD",82,83,"53"]
[16,"E1","30",225,48,{"$f":"ROUND(Advance_curve!$K161,0)","v":152},{"$f":"ROUND(Advance_curve!$K162,0)","v":153},{"$f":"ROUND(Advance_curve!$K163,0)","v":154},{"$f":"ROUND(Advance_curve!$K164,0)","v":154},{"$f":"ROUND(Advance_curve!$K165,0)","v":155},{"$f":"ROUND(Advance_curve!$K166,0)","v":156},{"$f":"ROUND(Advance_curve!$K167,0)","v":157},{"$f":"ROUND(Advance_curve!$K168,0)","v":158},null,":10E13000980099009A009A009B009C009D009E0008",null,"98 99 9A 9A   9B 9C 9D 9E",null,1528,"5F8","F8",7,8,"08"]
[16,"E1","40",225,64,0,0,0,0,0,0,0,0,null,":10E1400000000000000000000000000000000000CF",null,"00 00 00 00   00 00 00 00",null,305,"131","31",206,207,"CF"]
[16,"E1","50",225,80,0,0,0,0,0,0,0,0,null,":10E1500000000000000000000000000000000000BF",null,"00 00 00 00   00 00 00 00",null,321,"141","41",190,191,"BF"]
[16,"E1","60",225,96,0,0,0,0,0,0,0,0,null,":10E1600000000000000000000000000000000000AF",null,"00 00 00 00   00 00 00 00",null,337,"151","51",174,175,"AF"]
[16,"E1","70",225,112,0,0,0,0,0,0,0,0,null,":10E17000000000000000000000000000000000009F",null,"00 00 00 00   00 00 00 00",null,353,"161","61",158,159,"9F"]
[16,"E1","80",225,128,0,0,0,0,0,0,0,0,null,":10E18000000000000000000000000000000000008F",null,"00 00 00 00   00 00 00 00",null,369,"171","71",142,143,"8F"]
[16,"E1","90",225,144,0,0,0,0,0,0,0,0,null,":10E19000000000000000000000000000000000007F",null,"00 00 00 00   00 00 00 00",null,385,"181","81",126,127,"7F"]
[16,"E1","A0",225,160,0,0,0,0,0,0,0,0,null,":10E1A000000000000000000000000000000000006F",null,"00 00 00 00   00 00 00 00",null,401,"191","91",110,111,"6F"]
[16,"E1","B0",225,176,0,0,0,0,0,0,0,0,null,":10E1B000000000000000000000000000000000005F",null,"00 00 00 00   00 00 00 00",null,417,"1A1","A1",94,95,"5F"]
[16,"E1","C0",225,192,0,0,0,0,0,0,0,0,null,":10E1C000000000000000000000000000000000004F",null,"00 00 00 00   00 00 00 00",null,433,"1B1","B1",78,79,"4F"]
[16,"E1","D0",225,208,{"$f":"Advance_curve!K1","v":79},{"$f":"Advance_curve!L1","v":25},{"$f":"Advance_curve!M1","v":1},0,0,0,0,0,null,":10E1D0004F001900010000000000000000000000D6",null,"4F 19 01 00   00 00 00 00",null,554,"22A","2A",213,214,"D6"]
[16,"E1","E0",225,224,{"$f":"Advance_curve!N44","v":160},0,{"$f":"Advance_curve!F5","v":75},{"$f":"Advance_curve!O42","v":1},200,{"$f":"Advance_curve!O40","v":1},{"$f":"Advance_curve!O38","v":1},{"$f":"Advance_curve!O36","v":0},null,":10E1E000A00000004B000100C80001000100000079",null,"A0 00 4B 01   C8 01 01 00",null,903,"387","87",120,121,"79"]
[16,"E1","F0",225,240,{"$f":"LowRPM!I2","v":92},{"$f":"INT((Advance_curve!C4/Advance_curve!N30)*(60*1000000)/Advance_curve!N34/256)","v":30},{"$f":"IF(Advance_curve!N32=\"Auto\",99,Advance_curve!N32/500)","v":99},{"$f":"Advance_curve!N30","v":8},0,{"$f":"Advance_curve!K5","v":40},{"$f":"Advance_curve!B9","v":15},{"$f":"Advance_curve!C5","v":174},null,":10E1F0005C001E0063000800000028000F00AE0055",null,"5C 1E 63 08   00 28 0F AE",null,939,"3AB","AB",84,85,"55"]
[null,null,null,null,null,"End of File",null,null,null,null,null,null,null,null,":00000001FF"]
[]
[]
[]
[null,null,null,null,null,null,null,null,null,null,null,null,null,null,"The checksum value is the two's complement of the least significant byte (LSB) of the sum of all decoded byte values in the record that precede the checksum. "]
[null,null,null,null,null,null,null,null,null,null,null,null,null,null,"It is computed by summing the decoded byte values, extracting the LSB of the sum, and calculating the two's complement of the LSB"]
[null,null,null,null,null,null,null,null,null,null,null,null,null,null,"(e.g., by inverting its bits and adding one)."]
[null,null,null,null,null,null,null,null,null,null,null,null,null,null,"For example, in the case of the record :0300300002337A1E, the sum of the decoded byte values is 03 + 00 + 30 + 00 + 02 + 33 + 7A = E2."]
[null,null,null,null,null,null,null,null,null,null,null,null,null,null,"The two's complement of E2 is 1E, which is the checksum appearing at the end of the record."]
[]
[null,null,null,null,null,null,null,null,null,null,null,null,null,null,"Pour effectuer un complément à 2 il faut :"]
[null,null,null,null,null,null,null,null,null,null,null,null,null,null,"- Inverser tout les bits (1 en 0, 0 en 1) (ou faire 255-chiffre) pour faire le complement a 1"]
[null,null,null,null,null,null,null,null,null,null,null,null,null,null," puis ajouter 1 au résultat"]
[null,null,null,null,null,null,null,null,null,null,null,null,null,null,"Ex: DECHEX(255-SOMME(B3:K3)+1) = DECHEX(255+1-SOMME(B3:K3)) = DECHEX(256-SOMME(B3:K3))"]
[null,null,null,null,null,null,null,null,null,null,null,null,null,null,"le complement a 2 de 0 est egal a 0"]
[null,null,null,null,null,null,null,null,null,null,null,null,null,null,"Si 2 derniers chiffres de h100 = 00: cksum OK"]
[]
[null,null,null,null,null,null,null,null,null,null,null,null,null,null,"Méthode 1 (1er onglet)"]
[null,null,null,null,null,null,null,null,null,null,null,null,null,null,"C'est la méthode bestiale. On convertit le nombre (positif) en base 2, puis on inverse les bits et ensuite on ajoute 1 avec propagation d'une éventuelle retenue."]
[]
[null,null,null,null,null,null,null,null,null,null,null,null,null,null,"Méthode 2 (2ème onglet)"]
[null,null,null,null,null,null,null,null,null,null,null,null,null,null,"On utilise la formule suivante pour le complément à 2: Si X est le nombre négatif à convertir, la conversion de (2^16)-|X| en base 2 donne le résultat."]
[]
[]
[]
[]
[]
[]
[]
[]
[]
[]
[]
[]
[]
[]
[]
[null,":10E000001B"]
[null,":BBAAAATTHHHHHH.....HHHHCC"]
[null,"BB est le nombre d'octets de données dans la ligne (en hexadécimal)"]
[null,"AAAA est l'adresse absolue (ou relative) du début de la lign"]
[null,"TT est le champ spécifiant le type"]
[null,"HH...HHHH est le champ des données",null,null,null,null,null,null,null,"00, données, contient les données et l'adresse 16 bit."]
[null,"CC est l'octet de checksum. C'est le complément à deux de la somme des valeurs binaires des octets de tous les autres champs. (Les calculs sont faits sur 8 bits, en ignorant les retenues.)"]
[]
[null,"Pour vérifier la validité des données, il suffit de faire la somme de tous les octets représentés, à partir des deux-points jusqu'à la fin de ligne (checksum inclus: BB+AA+AA+TT+HH+...+CC): le résultat attendu est 0 (modulo 256)."]

{"sheet":"Accuracy","index":4,"n_rows":16,"n_cols":3,"rows_kept":16,"cut":false,"hidden":false,"merged":[]}
["CYLINDRE:",1,"cyl"]
["STROKES",2,"stk"]
["ACCURACY",3.4,"us"]
[]
["RPM","ERROR"]
[0,0]
[1000,{"$f":"$B$3/((1000*(60*$B$2)/(2*$B$1*$A7))/0.36)","v":0.0204}]
[2000,0.0408]
[3000,0.0612]
[4000,0.0816]
[5000,0.102]
[6000,0.1224]
[7000,0.1428]
[8000,0.1632]
[9000,0.1836]
[10000,0.204]

{"sheet":"formules","index":5,"n_rows":66,"n_cols":25,"rows_kept":66,"cut":false,"hidden":false,"merged":[[0,10,0,11],[16,10,16,11],[16,13,16,14],[16,15,16,16],[17,15,17,16],[63,4,63,7],[63,8,63,11],[64,4,64,7],[64,8,64,11],[65,4,65,11]]}
[null,null,null,null,"TEMPS","CYLINDRE","RPM","FREQUENCE","PERIODE","PERIODE","1°",null,"durée =","degrés","relatif\npickup"]
[null,null,null,null,"Nbr","Nbr","tr/mn","Hz","ms","pour 2cyl 2tps","ms","us","us",null,{"$f":"Advance_curve!F5","v":75},null,null,null,null,null,null,null,"4 stk:"]
[null,null,null,null,2,1,5000,{"$f":"(2*$F$3*$G$3)/(60*$E$3)","v":83.3333333333333},{"$f":"1000*(60*$E$3)/(2*$F$3*$G$3)","v":12},{"$f":"1000*60/$G$3","v":12},{"$f":"I3/360","v":0.0333333333333333},{"$f":"I3/0.36","v":33.3333333333333},64000,{"$f":"M3/L3","v":1920},{"$f":"Advance_curve!F5-N3","v":-1845},null,null,null,null,null,null,null,"1 cyl","1/2 spark every rotation","720°"]
[null,null,null,null,null,null,null,null,{"$f":"1000*I3","v":12000},null,null,null,null,null,null,null,null,null,null,null,null,null,"2 cyl","1 spark every rotation","360°"]
[null,null,null,null,null,null,{"$f":"(60*$H$5*$E$3)/(2*$F$3)","v":120},2,{"$f":"1000*(60*$E$3)/(2*$F$3*$G$5)","v":500},{"$f":"1000*60/$G$5","v":500},{"$f":"I5/360","v":1.38888888888889},{"$f":"I5/0.36","v":1388.88888888889},null,"FRQ = (2*CYL*RPM) / (60*TEMPS)",null,null,null,null,null,null,null,null,"3 cyl","1,5 spark every rotation","240°"]
[null,null,null,null,null,null,null,null,null,null,null,null,null,"RPM = (60*FRQ*TEMPS) / ( 2*CYL)",null,null,null,null,null,null,null,null,"4 cyl","2 sparks every rotation","180°"]
[null,null,null,null,null,null,"Délai","=>","Délai","Avance",null,null,null,"1degré = (1000*1000*60*CYL) / ( 2*TEMPS*RPM)/360",null,null,null,null,null,null,null,null,"5 cyl","2,5 sparks every rotation","144°"]
[null,null,null,null,null,null,"us",null,"°","°",null,null,null,"RPM= 60*1000000/ TMR1*256*presc/Fosc",null,null,null,null,null,null,null,null,"6 cyl","3 sparks every rotation","120°"]
[null,null,null,null,null,null,9600,null,{"$f":"G9/L3","v":288},{"$f":"Advance_curve!F5-I9","v":-213},null,null,null,"TMR1=(PER*Fosc)/ presc*255",null,null,null,null,null,null,null,null,"10 cyl","5 sparks every rotation","72°"]
[null,null,null,null,null,null,null,null,null,null,null,null,null,"FRQ = 1/TMR1H = 1/TMR1H * (255 * PRES/Fosc) = 1*1000000 / TMR1H* (255 * PRES/Fosc) ",null,null,null,null,null,null,null,null,"12 cyl","6 sparks every rotation","60°"]
[2.5,null,null,null,null,null,"Frequence","=>","RPM","PERIODE"]
[null,null,null,null,null,null,100,"Hz",{"$f":"60*G12*$E$3/2*$F$3","v":6000},{"$f":"1000/G12","v":10},"ms"]
[]
[null,null,null,null,null,null,"Periode","=>","RPM","FRQ",null,null,null,null,null,null,null,null,"2 stk = 1 sprk per rev."]
[null,null,null,null,null,null,2,"ms",{"$f":"60*(1000/G15)*$E$3/(2*$F$3)","v":30000},{"$f":"1000/G15","v":500},"Hz",null,null,null,null,null,null,null,"4 stk = 1 sprk per 2 rev."]
[null,null,null,null,null,null,null,null,null,null,null,null,null,null,null,null,null,null,"At 1000 rpm, 2stk = 1000 sparks/mn = 1000/60sec = 16Hz"]
[null,"Clock","Fosc","Multiplier","Delay","Prescaler","Nombre de","Nombre","Fréquence","Régime","Période",null,"TIMER1","Delay of:",null,{"$f":"IF(Q20>0,\"Avance\",\"RETARD\")","v":"RETARD"},null,null,"At 1000 rpm, 4stk = 500 sparks/mn = 500/60sec = 8Hz"]
[null,null,null,null,null,null,"Cylindres","de temps",null,null,null,null,"high",null,null,"BTDC",null,null,null,"Then to multiply but the number of cylinders"]
[null,"MHz","MHz",null,"us",null,null,null,"Hz","tr/mn","ms","µs",{"$f":"IF(M20>127,\"erreur\",\"\")","v":""},"µs","ms","ms","degrees",null,null,"2 stk x 1cyl = 16Hz"]
[null,{"$f":"Advance_curve!C3","v":16},{"$f":"Advance_curve!C4","v":4},8,20,{"$f":"Advance_curve!N30","v":8},{"$f":"F3","v":1},{"$f":"E3","v":2},{"$f":"H3","v":83.3333333333333},{"$f":"(60*I20*H20)/(2*G20)","v":5000},{"$f":"1000/I20","v":12},{"$f":"1000000/I20","v":12000},{"$f":"INT(L20*C20/($F$20*255))","v":23},{"$f":"($E$20*$M$20*$D$20)","v":3680},{"$f":"N20/1000","v":3.68},{"$f":"(K20/360)*Advance_curve!F5-O20","v":-1.18},{"$f":"(360/K20)*P20","v":-35.4},null,null,"2 stk x 2cyl = 30hz"]
[]
[]
[]
[null,null,null,"http://syskb.com/creer-une-liste-deroulante-dans-excel-2010/",null,null,null,null,null,null,null,null,null,null,null,"DUREE",null,null,"F = (P/2)(N/60) => F=P*N/120"]
[null,null,null,null,null,null,null,null,null,null,null,null,null,null,null,"us",null,null,"N: rpm"]
[null,null,null,"TIMER 0","8bits",null,null,null,null,"Timer1","16bits = 65535 max",null,null,null,null,300]
[null,null,null,"Quartz a 4MHz",null,null,null,null,null,"Quartz a 4MHz",null,null,null,null,null,null,null,null,"Tension produite:"]
[null,null,null,"4 cycles d'horloge par operation: Fosc/4 or 4MHz/4 = 1MHz",null,null,null,null,null,"4 cycles d'horloge par operation: Fosc/4 or 4MHz/4 = 1MHz",null,null,null,null,null,null,null,null,"Erms=(K * ω * N * θ ) / √2"]
[null,null,null,"- Prescaler sur 256 dans le registre T0CON",null,null,null,null,null,"- Prescaler sur 8 dans le registre T1CON",null,null,null,null,null,null,null,null,"Erms=4,44 * K * F * N * θ"]
[null,null,null,"- period of the frequency input to Timer 0 :",null,null,null,null,null,"- period of the frequency input to Timer 1 : (toutes les 8us , TMR1 avance d'un cran)"]
[null,null,null,"1/(1MHz/256) = 256us",null,null,null,null,null,"1/(1MHz/8) = 8us",null,null,null,null,null,null,null,null,"Courant produit:"]
[null,null,null,"This is the period of time for each count in Timer 0 i.e.",null,null,null,null,null,"This is the period of time for each count in Timer 1 i.e.",null,null,null,null,null,null,null,null,"I = (θ * N) / L"]
[null,null,null,"256 * 256us = 65536us = 65.636ms = 15.26Hz",null,null,null,null,null,"65536 * 8us = 525ms = 1,9Hz"]
[]
[null,null,null,"Lorsque TMR0=10, il s'est écoulé 10x256us = 2560us = 2,6ms.",null,null,null,null,null,"PRESC=1 => TMR1L s'incrémente de 1 en 1us jusqu'a 255. TMR1H s'incremente de 1 en 256us,  deborde toutes les 65ms"]
[null,null,null,"Si entre temps le moteur a fait 1 tour, c'est qu'il tourne a 2,56ms par tour",null,null,null,null,null,"PRESC=2 => TMR1L s'incrémente de 1 en 2us jusqu'a 255. TMR1H s'incremente de 1 en 512us,  deborde ici toutes les 131ms"]
[null,null,null,"pour trouver des tours/mn: en 1mn (soit 60sec * 1000 = 60000ms)",null,null,null,null,null,"PRESC=4 => TMR1L s'incrémente de 1 en 4us jusqu'a 255. TMR1H s'incremente de 1 en 1024us, deborde ici toutes les 262ms"]
[null,null,null,"60000/2,56 = 23437 RPM",null,null,null,null,null,"PRESC=8 => TMR1L s'incrémente de 1 en 8us jusqu'a 255. TMR1H s'incremente de 1 en 2048us, deborde ici toutes les 525ms"]
[]
[]
[null,null,null,null,null,null,null,null,null,"Quartz a 16MHz"]
[null,null,null,null,null,null,null,null,null,"4 cycles d'horloge par operation: Fosc/4 or 16MHz/4 = 4MHz"]
[null,null,null,null,null,null,null,null,null,"- Prescaler sur 8 dans le registre T1CON",null,null,"(arrivé a 16bits 65535, TMR1 déborde et provoque INT)"]
[null,null,null,null,null,null,null,null,null,"- period of the frequency input to Timer 1 : (toutes les 2us , TMR1 avance d'un cran)"]
[null,null,null,null,null,null,null,null,null,"1/(4MHz/8) = 2us"]
[null,null,null,null,null,null,null,null,null,"This is the period of time for each count in Timer 1 i.e."]
[null,null,null,null,null,null,null,null,null,"65536 * 2us = 131ms = 7,6Hz"]
[]
[null,null,null,null,null,null,null,null,null,"PRESC=1 => TMR1L s'incrémente de 1 en 0.25us jusqu'a 255. TMR1H s'incrémente de 1 en  64us et déborde en 16ms"]
[null,null,null,null,null,null,null,null,null,"PRESC=2 => TMR1L s'incrémente de 1 en 0.5us jusqu'a 255. TMR1H s'incrémente de 1 en 128us et déborde en 32ms <==="]
[null,null,null,null,null,null,null,null,null,"PRESC=4 => TMR1L s'incrémente de 1 en 1us jusqu'a 255. TMR1H s'incrémente de 1 en 256us et déborde en 65ms"]
[null,null,null,null,null,null,null,null,null,"PRESC=8 => TMR1L s'incrémente de 1 en 2us jusqu'a 255. TMR1H s'incrémente de 1 en 512us et déborde en 131ms"]
[]
[null,null,null,null,null,null,null,null,null,"Calculator:"]
[null,null,null,null,null,null,null,null,null,"http://eng-serve.com/pic/pic_timer.html"]
[null,null,null,"Conversion BIN to HEX:"]
[]
[null,null,null,"Position",8,7,6,5,4,3,2,1]
[null,null,null,"numero",7,6,5,4,3,2,1,0]
[null,null,null,"Puissance","2^3","2^2","2^1","2^0","2^3","2^2","2^1","2^0"]
[null,null,null,"Valeur 2x4bits",8,4,2,1,8,4,2,1]
[null,null,null,"Binaire",0,1,1,0,1,0,1,1]
[null,null,null,"Valeur",{"$f":"E62*E61","v":0},4,2,0,8,0,2,1]
[null,null,null,"2x4bits",{"$f":"E63+F63+G63+H63","v":6},null,null,null,{"$f":"I63+J63+K63+L63","v":11}]
[null,null,null,"Hexa 2x4bits",{"$f":"DEC2HEX(E64)","v":"6"},null,null,null,{"$f":"DEC2HEX(I64)","v":"B"}]
[null,null,null,"Hexa",{"$f":"CONCATENATE(E65,I65)","v":"6B"}]

{"sheet":"Calculs","index":6,"n_rows":39,"n_cols":6,"rows_kept":39,"cut":false,"hidden":false,"merged":[]}
[]
["- Tant que pickup est bas (=0) 99% du temps, on met la valeur du TIMER0 dans la variable PERL (PERiode Low)"]
["- Chaque fois que TIMER0 provoque une INTerruption de debordement lorsqu'il arrive a 255,  dans la routine d'interruption on incremente TMR0H (TIMER0 High)"]
["- Quand le pickup est haut (=1) (pulse) :"]
["- on memorise la valeur de TMR0H (Nbr de debordements de TIMER0), dans PERH (PERiode High)"]
["- et on memorise aussi la valeur du TIMER0 dans la variable PERL."]
["- puis on RAZ les timers,"]
[]
["- Ainsi la durée ecoulé entre 2 pickups est stockée dans PERL et PERH.   Soit : (PERH x 255 ) + PERL"]
[]
["Avec Q=4MHz, Prescaler = 256 et Preset = 0"]
["TIMER0 s'incremente toutes les 256us et deborde toutes les 256x256= 65536us = 65,5ms = 15,25Hz"]
["(utiliser: E:\\Pic\\Exemples\\pic_calculations.xls)"]
["- donc [ (PERH * 255 ) + PERL ] * 65,5ms = durée entre 2 pulses."]
[]
["- Dans le soft:"]
["- on regarde si PERH est > a une certaine valeur, auquel cas le moteur tourne très lentement"]
["- on regarde si PERL est < a une certaine valeur, auquel cas le moteur tourne trop vite => arret des sparks pour limiter le regime"]
["- on regarde si PERL est < a une certaine valeur, auquel cas le moteur tourne très vite => spark immediat (sans avance)"]
["- entre ces 2 limites, on lit un tableau qui retourne un chiffre (delay) pour chacune des 95 valeurs de PERL"]
["- ce DELAY est le temps d'attente (nbr de boucles d'atttente) avant d'envoyer le spark"]
[]
["Propriete de l'interruption:"]
[]
[]
[null,null,null,null,null,"Liste deroulante"]
[null,null,null,null,null,"selectionner la cellule "]
[null,null,null,null,null,"donnees> validité des données> validite des donnees > afficher: liste"]
[]
[]
[]
[]
[]
[]
[]
[]
[]
["Quand 4MHZ, a 15,4Hz = 924RPM, il faut 64935us pour faire un tour, donc TIMER0 a le temps d'aller jusqu’à 254 et de presque deborder:"]
["Quand 16MHZ, a 15,4Hz = 924RPM, il faut 64935us pour faire un tour, donc TIMER1-High (les débords de TMR1) a le temps d'aller jusqu’à 127"]

{"sheet":"Dwell variable","index":7,"n_rows":98,"n_cols":5,"rows_kept":98,"cut":false,"hidden":false,"merged":[]}
[]
[null,null,null,"coef:","DWELL = PERIODE * 50"]
[null,{"$f":"Advance_curve!B8","v":"TIMER1H count"},null,50]
[null,{"$f":"Advance_curve!B9","v":15},{"$f":"$D$3*Advance_curve!B9","v":750},"µs"]
[null,{"$f":"Advance_curve!B10","v":16},{"$f":"$D$3*Advance_curve!B10","v":800}]
[null,{"$f":"Advance_curve!B11","v":17},{"$f":"$D$3*Advance_curve!B11","v":850}]
[null,{"$f":"Advance_curve!B12","v":18},{"$f":"$D$3*Advance_curve!B12","v":900}]
[null,{"$f":"Advance_curve!B13","v":19},{"$f":"$D$3*Advance_curve!B13","v":950}]
[null,{"$f":"Advance_curve!B14","v":20},{"$f":"$D$3*Advance_curve!B14","v":1000}]
[null,{"$f":"Advance_curve!B15","v":21},{"$f":"$D$3*Advance_curve!B15","v":1050}]
[null,{"$f":"Advance_curve!B16","v":22},{"$f":"$D$3*Advance_curve!B16","v":1100}]
[null,{"$f":"Advance_curve!B17","v":23},{"$f":"$D$3*Advance_curve!B17","v":1150}]
[null,{"$f":"Advance_curve!B18","v":24},{"$f":"$D$3*Advance_curve!B18","v":1200}]
[null,{"$f":"Advance_curve!B19","v":25},{"$f":"$D$3*Advance_curve!B19","v":1250}]
[null,{"$f":"Advance_curve!B20","v":26},{"$f":"$D$3*Advance_curve!B20","v":1300}]
[null,{"$f":"Advance_curve!B21","v":27},{"$f":"$D$3*Advance_curve!B21","v":1350}]
[null,{"$f":"Advance_curve!B22","v":28},{"$f":"$D$3*Advance_curve!B22","v":1400}]
[null,{"$f":"Advance_curve!B23","v":29},{"$f":"$D$3*Advance_curve!B23","v":1450}]
[null,{"$f":"Advance_curve!B24","v":30},{"$f":"$D$3*Advance_curve!B24","v":1500}]
[null,{"$f":"Advance_curve!B25","v":31},{"$f":"$D$3*Advance_curve!B25","v":1550}]
[null,{"$f":"Advance_curve!B26","v":32},{"$f":"$D$3*Advance_curve!B26","v":1600}]
[null,{"$f":"Advance_curve!B27","v":33},{"$f":"$D$3*Advance_curve!B27","v":1650}]
[null,{"$f":"Advance_curve!B28","v":34},{"$f":"$D$3*Advance_curve!B28","v":1700}]
[null,{"$f":"Advance_curve!B29","v":35},{"$f":"$D$3*Advance_curve!B29","v":1750}]
[null,{"$f":"Advance_curve!B30","v":36},{"$f":"$D$3*Advance_curve!B30","v":1800}]
[null,{"$f":"Advance_curve!B31","v":37},{"$f":"$D$3*Advance_curve!B31","v":1850}]
[null,{"$f":"Advance_curve!B32","v":38},{"$f":"$D$3*Advance_curve!B32","v":1900}]
[null,{"$f":"Advance_curve!B33","v":39},{"$f":"$D$3*Advance_curve!B33","v":1950}]
[null,{"$f":"Advance_curve!B34","v":40},{"$f":"$D$3*Advance_curve!B34","v":2000}]
[null,{"$f":"Advance_curve!B35","v":41},{"$f":"$D$3*Advance_curve!B35","v":2050}]
[null,{"$f":"Advance_curve!B36","v":42},{"$f":"$D$3*Advance_curve!B36","v":2100}]
[null,{"$f":"Advance_curve!B37","v":43},{"$f":"$D$3*Advance_curve!B37","v":2150}]
[null,{"$f":"Advance_curve!B38","v":44},{"$f":"$D$3*Advance_curve!B38","v":2200}]
[null,{"$f":"Advance_curve!B39","v":45},{"$f":"$D$3*Advance_curve!B39","v":2250}]
[null,{"$f":"Advance_curve!B40","v":46},{"$f":"$D$3*Advance_curve!B40","v":2300}]
[null,{"$f":"Advance_curve!B41","v":47},{"$f":"$D$3*Advance_curve!B41","v":2350}]
[null,{"$f":"Advance_curve!B42","v":48},{"$f":"$D$3*Advance_curve!B42","v":2400}]
[null,{"$f":"Advance_curve!B43","v":49},{"$f":"$D$3*Advance_curve!B43","v":2450}]
[null,{"$f":"Advance_curve!B44","v":50},{"$f":"$D$3*Advance_curve!B44","v":2500}]
[null,{"$f":"Advance_curve!B45","v":51},{"$f":"$D$3*Advance_curve!B45","v":2550}]
[null,{"$f":"Advance_curve!B46","v":52},{"$f":"$D$3*Advance_curve!B46","v":2600}]
[null,{"$f":"Advance_curve!B47","v":53},{"$f":"$D$3*Advance_curve!B47","v":2650}]
[null,{"$f":"Advance_curve!B48","v":54},{"$f":"$D$3*Advance_curve!B48","v":2700}]
[null,{"$f":"Advance_curve!B49","v":55},{"$f":"$D$3*Advance_curve!B49","v":2750}]
[null,{"$f":"Advance_curve!B50","v":56},{"$f":"$D$3*Advance_curve!B50","v":2800}]
[null,{"$f":"Advance_curve!B51","v":57},{"$f":"$D$3*Advance_curve!B51","v":2850}]
[null,{"$f":"Advance_curve!B52","v":58},{"$f":"$D$3*Advance_curve!B52","v":2900}]
[null,{"$f":"Advance_curve!B53","v":59},{"$f":"$D$3*Advance_curve!B53","v":2950}]
[null,{"$f":"Advance_curve!B54","v":60},{"$f":"$D$3*Advance_curve!B54","v":3000}]
[null,{"$f":"Advance_curve!B55","v":61},{"$f":"$D$3*Advance_curve!B55","v":3050}]
[null,{"$f":"Advance_curve!B56","v":62},{"$f":"$D$3*Advance_curve!B56","v":3100}]
[null,{"$f":"Advance_curve!B57","v":63},{"$f":"$D$3*Advance_curve!B57","v":3150}]
[null,{"$f":"Advance_curve!B58","v":64},{"$f":"$D$3*Advance_curve!B58","v":3200}]
[null,{"$f":"Advance_curve!B59","v":65},{"$f":"$D$3*Advance_curve!B59","v":3250}]
[null,{"$f":"Advance_curve!B60","v":66},{"$f":"$D$3*Advance_curve!B60","v":3300}]
[null,{"$f":"Advance_curve!B61","v":67},{"$f":"$D$3*Advance_curve!B61","v":3350}]
[null,{"$f":"Advance_curve!B62","v":68},{"$f":"$D$3*Advance_curve!B62","v":3400}]
[null,{"$f":"Advance_curve!B63","v":69},{"$f":"$D$3*Advance_curve!B63","v":3450}]
[null,{"$f":"Advance_curve!B64","v":70},{"$f":"$D$3*Advance_curve!B64","v":3500}]
[null,{"$f":"Advance_curve!B65","v":71},{"$f":"$D$3*Advance_curve!B65","v":3550}]
[null,{"$f":"Advance_curve!B66","v":72},{"$f":"$D$3*Advance_curve!B66","v":3600}]
[null,{"$f":"Advance_curve!B67","v":73},{"$f":"$D$3*Advance_curve!B67","v":3650}]
[null,{"$f":"Advance_curve!B68","v":74},{"$f":"$D$3*Advance_curve!B68","v":3700}]
[null,{"$f":"Advance_curve!B69","v":75},{"$f":"$D$3*Advance_curve!B69","v":3750}]
[null,{"$f":"Advance_curve!B70","v":76},{"$f":"$D$3*Advance_curve!B70","v":3800}]
[null,{"$f":"Advance_curve!B71","v":77},{"$f":"$D$3*Advance_curve!B71","v":3850}]
[null,{"$f":"Advance_curve!B72","v":78},{"$f":"$D$3*Advance_curve!B72","v":3900}]
[null,{"$f":"Advance_curve!B73","v":79},{"$f":"$D$3*Advance_curve!B73","v":3950}]
[null,{"$f":"Advance_curve!B74","v":80},{"$f":"$D$3*Advance_curve!B74","v":4000}]
[null,{"$f":"Advance_curve!B75","v":81},{"$f":"$D$3*Advance_curve!B75","v":4050}]
[null,{"$f":"Advance_curve!B76","v":82},{"$f":"$D$3*Advance_curve!B76","v":4100}]
[null,{"$f":"Advance_curve!B77","v":83},{"$f":"$D$3*Advance_curve!B77","v":4150}]
[null,{"$f":"Advance_curve!B78","v":84},{"$f":"$D$3*Advance_curve!B78","v":4200}]
[null,{"$f":"Advance_curve!B79","v":85},{"$f":"$D$3*Advance_curve!B79","v":4250}]
[null,{"$f":"Advance_curve!B80","v":86},{"$f":"$D$3*Advance_curve!B80","v":4300}]
[null,{"$f":"Advance_curve!B81","v":87},{"$f":"$D$3*Advance_curve!B81","v":4350}]
[null,{"$f":"Advance_curve!B82","v":88},{"$f":"$D$3*Advance_curve!B82","v":4400}]
[null,{"$f":"Advance_curve!B83","v":89},{"$f":"$D$3*Advance_curve!B83","v":4450}]
[null,{"$f":"Advance_curve!B84","v":90},{"$f":"$D$3*Advance_curve!B84","v":4500}]
[null,{"$f":"Advance_curve!B85","v":91},{"$f":"$D$3*Advance_curve!B85","v":4550}]
[null,{"$f":"Advance_curve!B86","v":92},{"$f":"$D$3*Advance_curve!B86","v":4600}]
[null,{"$f":"Advance_curve!B87","v":93},{"$f":"$D$3*Advance_curve!B87","v":4650}]
[null,{"$f":"Advance_curve!B88","v":94},{"$f":"$D$3*Advance_curve!B88","v":4700}]
[null,{"$f":"Advance_curve!B89","v":95},{"$f":"$D$3*Advance_curve!B89","v":4750}]
[null,{"$f":"Advance_curve!B90","v":96},{"$f":"$D$3*Advance_curve!B90","v":4800}]
[null,{"$f":"Advance_curve!B91","v":97},{"$f":"$D$3*Advance_curve!B91","v":4850}]
[null,{"$f":"Advance_curve!B92","v":98},{"$f":"$D$3*Advance_curve!B92","v":4900}]
[null,{"$f":"Advance_curve!B93","v":99},{"$f":"$D$3*Advance_curve!B93","v":4950}]
[null,{"$f":"Advance_curve!B94","v":100},{"$f":"$D$3*Advance_curve!B94","v":5000}]
[null,{"$f":"Advance_curve!B95","v":101},{"$f":"$D$3*Advance_curve!B95","v":5050}]
[null,{"$f":"Advance_curve!B96","v":102},{"$f":"$D$3*Advance_curve!B96","v":5100}]
[null,{"$f":"Advance_curve!B97","v":103},{"$f":"$D$3*Advance_curve!B97","v":5150}]
[null,{"$f":"Advance_curve!B98","v":104},{"$f":"$D$3*Advance_curve!B98","v":5200}]
[null,{"$f":"Advance_curve!B99","v":105},{"$f":"$D$3*Advance_curve!B99","v":5250}]
[null,{"$f":"Advance_curve!B100","v":106},{"$f":"$D$3*Advance_curve!B100","v":5300}]
[null,{"$f":"Advance_curve!B101","v":107},{"$f":"$D$3*Advance_curve!B101","v":5350}]
[null,{"$f":"Advance_curve!B102","v":108},{"$f":"$D$3*Advance_curve!B102","v":5400}]
[null,{"$f":"Advance_curve!B103","v":109},{"$f":"$D$3*Advance_curve!B103","v":5450}]

{"sheet":"Version","index":8,"n_rows":73,"n_cols":12,"rows_kept":73,"cut":false,"hidden":false,"merged":[]}
[]
["v7.9r13c2","[HARD] Correction RA1 forcé a 1, car pullup R5 sur PCB"]
["v7.9r13c3","[XLS] Valeur de dwell passe de 2 choix (500,1000) a 6 choix (500,1000,2000,3000,4000,5000)."]
["v7.9r14c0","[SOFT,XLS] Ajout d'une valeur de dwell \"AUTO\" pour lequel la durée de dwell est proportionnelle a PERIODE."]
["v7.9r14c1","[SOFT] Code protection OFF"]
["v7.9r15c0","[XLS] La valeur d'avance affichée dans l'onglet \"advance_at_lowRPM\" ne prenait pas en compte la position du pickup, c'était donc une valeur RELATIVE, pas ABSOLUE. Multiplicateur peut descendre a 1 (soft OK)"]
[null,"[SOFT] si JP2 a la masse alors PIC bypass la courbe d'avance et envoi spark dés que detection front descendant du pickup"]
[null,"[SOFT] RB3 (ex TP2) n'était pas forcé en OUTPUT"]
[null,"[HARD] Suppression TP2 inutile"]
[null,"[HARD] Reduction R7 de 330 a 180 (Sinon ne declenche pas les SCR de type BTA)."]
[null,"[HARD] Suppression C9-100n car courant d'appel dépasse Imax du PIC"]
["v7.9r16c0","[XLS] La valeur d'avance affichée dans l'onglet \"advance_at_lowRPM\" était fausse."]
[null,"[SOFT] boucles d'attente pkp haut et bas en ASM: Precision x10 !!"]
[null,"[XLS] Ajout documentation onglet README"]
["v7.9r16c1","[XLS] Tuning: a low RPM, le PIC attend 4us x PERIODE mais en vrai bcl dure plus de 4us, du coup il y a un offset de 5deg (20° affiché et 15° reels)\npour simplifier correction: la valeur delay (I1) passe de 4 a 4.4"]
[null,"[SOFT] Calibration de la boucle 40us"]
["v7.9r17c0","[XLS] Ajout d'un Rev Limiter a l'adresse Eprom 121 si swich JP2 a la masse"]
[null,"[SOFT] JP2 (ex Bypass curve) est utilisé pour activer une limitation de RPM inferieur au maxi et stocké en @121 de l'eprom (Scooter légal)"]
["v7.9r17c1","[XLS] Renommage en accord avec code. Ajout RPM mini dans le titre onglet low_rpm"]
["v7.9r18c0","[XLS] Ajout d'un délai at Kick Start selectionnable par le user"]
[null,"[SOFT] Si TMR1 déborde, PIC attend une pause d'une durée fixe VLRPM qui a été définie par le user et écrite en eprom. Sinon spark immediate entre 0 et 480RPM car TMR1 = 0 = croit que RPM élévés"]
["v7.9r19c0","[XLS] Ajout step 200us permet de positionner le pkp jusqu’à 360° btdc"]
[null,"[SOFT] Ajout step 200us permet de positionner le pkp jusqu’à 360° btdc"]
[null,"[SOFT] Si TMR1 déborde, PIC attend une pause de Nbr débordements * VLRPM qui a été définie par le user et écrite en eprom. Sinon spark immediate entre 0 et 480RPM car TMR1 = 0 = croit que RPM élévés"]
["v7.9r20c0","[SOFT] Suppresion JP1: autospark et RB3 output PWM"]
[null,"[SOFT] RB3 devient RevCoil, RB5 devient sortie Tacho, meme signal que RA2"]
[null,"[SOFT] Lecture de JP2 (rev limit) dés que pkp repasse a 1, donc possible de changer rpm limit pendant la marche"]
[null,"[XLS] Modif commentaire dwell, Renommage en ACCDI_v79r20c0 (au lieu curve_adjust_16f628_xxxx)"]
[null,"[XLS] Ajout onglet EPROM16 pour configurer 16F628 directement avec pickit3 sans besoin de icprog"]
[null,"[HARD] option tachometer avec PIC 12F629"]
["v7.9r20c1","[XLS] Modif choix 2,4 stk wasted spark"]
[null,"[XLS] Correction. Le temps en us pour 1° changeait selon 2 ou 4tps ! (faux en 4)"]
[null,"[XLS] Portage sur 16F1827: reduction temps incompressible de 71 a 18us"]
["v7.9r20c2","[XLS] renommage en v79r20c1 avec suffixe 16F1847"]
[null,"[XLS] remplacement onglet EEPROM8 par EEPROM16"]
[null,"[XLS] Augmentation du nombre de trial de 20 a 50"]
[null,"[XLS] Ajout d'une cellule C11 dans VLRPM pour ajuster l'avance a ces regimes"]
[null,"[XLS] Modif 4MHz dans VLRPM"]
["v7.9r21c0","[SOFT] utilisation de INT sur RB4"]
[null,"[XLS] pas de modification"]
["v7.9r21c1","[XLS] correction du nbr de debord max de TMR1 (40/prescaler au lieu de 5 fixe)"]
["v7.9r21c2","[XLS] Le hash calculé dans Eeprom16 ne sert a rien avec PICkit3 qui ne le lit pas. Mais MPASM le lirait…"]
[null,"[XLS] Correction du Hash, il fallait additionner toute la ligne donc aussi 10h=16d qui est le nbr de bits"]
[null,"[XLS] Correction dans eeprom16 , arrondi de valeur eeprom sinon affichage arrondi mais valeur decimal du coup checksum faux car somme fausse"]
[null,"[XLS] Correction du hash, il n'y avait pas besoin de corriger la valeur de checksum"]
[null,"[SOFT] Free trial passe de 50 a 200, Ne clignote plus"]
[null,"[XLS] Free trial passe de 50 a 200"]
[null,"[XLS] macro VLRPM utilise clock de advance_curve"]
["v7.9r21c3","[XLS] ERROR N°1: La derniere ligne de \"advance curve\" a TMR1max correspond par ex a 123 = 950rpm/16Hz/62ms mais en vrai le PIC n'arrive ici qu'a 32Hz/31ms"]
[null,"car 16F1827 a 16MHz compte + vite et PERIODE arrive a 123 en 31ms (et pas en 62ms): Correction calcul RPM dans advance_curve"]
[null,"ERROR N°2: dans adv_low_rpm a 10Hz/600rpm il est censé y avoir délai: 10ms mais 50ms en vrai !!"]
[null,"Correction dans le calcul de la valeur de TMR1h qui ne tenait pas compte de la clock!"]
[null,"[XLS] Selection nbr d'aimants sur rotor 1 or 2. Si 2 aimants on ignore la 2em pulse (desactivé)"]
["v7.9r22c0","[SOFT] 16F1827 a plus de RAM que 16F628 : Augmentation de 96 (max pour 1 variable) a 2x80 valeurs d'avance en RAM (max pour 2 variables)"]
[null,"[XLS] 16F1827 a plus de RAM que 16F628 : Augmentation de 96 a 2x80 valeurs d'avance en RAM (onglets: eeprom16, adv_low_rpm, adv_curve,calcul,formule)"]
[null,"[XLS] Ajout cell M40 pour ajuster le RPM de bascule de l'onglet \"adv_curve\" a \"adv_low_rpm\" en cas de warning "]
[null,"[XLS] Correction limitation de RPM par JP2 (ne fonctionnait plus depuis 16F1827)"]
[null,"[XLS] activation choix LED au départ.  Ajout choix d'attendre un 1er tour moteur pour mesurer RPM ou pas"]
[null,"[XLS] correction: il fallait soustraire l'hysteresis plus 200us de délai entre détection pickup et debut compte a rebours"]
[null,"[SOFT] Calibration des boucles 20, 40us"]
[null,"[SOFT,XLS] Suppression du choix délai 200us inutile"]
["v7.9r23c1","[SOFT,XLS] pour les 80 premieres valeurs d'avance RETARDL[] le step est selectionnable par user 20,40,100 mais pour valeurs RPM faible (RETARDH) c'est forcé a 100us pour eviter warning en haut et en bas"]
[null,"[XLS] Correction, la colonne FRQ devait etre calculée d'apres TMR1 et non d'apres RPM. Maintenant c'est logique si on change 2tps ou 4tps"]
["v7.9r24c0","[XLS] Meme xls pour ACCDI et DCCDI, Ajout cellule N28 pour calibrer le délai \"I4\" en fct du temps de calcul du firmware (calibré en DCCDI en 028. RAF: ACCDI)",null,null,null,null,null,null,null,null,null,78]
[null,"[XLS] Desormais meme XLS pour AC et DCCDI"]
[null,"[SOFT] Correction: Si pickup arreté a 1 durant 1sec, ne redemarrait plus car MEMTMR1DEB constamment refixé par INT"]
[null,"[SOFT] Correction: il y avait une 2em spark de 0 jusqu'a 10Hz sauf de 7 a 8Hz (IOC n'etait pas a 0 avant boucle IOC)"]
[null,"[SOFT] modif FW DCCDI 100us est trop gros a HIGH rev et 40us trop petit a LOW rev: RETARDL[79] utilise une valeur STEP selectionnable de 20 a 40us et RETARDH[79] utilise une valeur STEP forcée a 100us"]
["v7.9r25c0","[SOFT,XLS] Simplification a low RPM, un seul onglet d'avance plate ajustable car on tient compte des débordements de TMR1H"]
[null,"[XLS] Correction formule du temps pour 1degré dans \"lowrpm\" pour que valeurs soient juste aussi en mode \"4tps no wasted spark\""]
[null,"[XLS] Correction: il fallait soustraire l'hysteresis de  200us plus le temps de calcul dans \"LowRPM\" aussi"]
[null,"[XLS] Correction: a lowrpm et si TMRDEB = 0 alors le temps de calcul dans la bcl de decrement periode est 10µs plus longue. (le rajouter a I2 dans cell W9 ou [fait] le soustraire dans la bcl FC"]
[null,"[SOFT] Correction: a lowrpm soustraire le temps de calcul dans la bcl FC  VLRPM -10"]

{"sheet":"Excel","index":9,"n_rows":10,"n_cols":3,"rows_kept":10,"cut":false,"hidden":false,"merged":[]}
[]
[]
["Conversion de valeurs: ",null,"=SI(I2=2;2;(SI(I2=3;3;(SI(I2=4;4;(SI(I2=5;5;(SI(I2=6;6)))))))))"]
[]
["Liste deroulante: ",null,"Donnees> Validite des donnees"]
[]
[]
["les graphes n'affichent pas la valeur #N/A  , utiliser #N/A pour faire disparaitre les points du graphe"]
[]
["Pour afficher les liens d'une cellule: selectionner la > Formule > Reperer les antécédents/dependants "]