{"text_format":"1","workbook":"xlsx","n_sheets":10,"sheets":["README","Advance_curve","LowRPM","EEPROM16","Accuracy","formules","Calculs","Dwell variable","Version","Excel"],"not_rendered":{"charts":6,"images":4,"macros":0,"external_links":0,"defined_names":2,"comments":4,"pivot_tables":0},"unopened":[],"bounds":{"document_bytes":16777216,"sheet_cells":100000,"rows_first":2000,"rows_last":500,"rows_between":2000,"halvings":0,"cell_chars":16384,"cell_head_chars":4096},"cells_cut":0,"cells_raw":0,"read":"whole","date_system":"1900"}

{"sheet":"README","index":0,"n_rows":19,"n_cols":8,"rows_kept":19,"cut":false,"hidden":false,"merged":[]}
[]
[null,"With the values your entered, the CDI behavior will be the following:"]
[]
[null,null,null,null,null,null,null,"Where to change that?"]
[]
[]
["A) ",{"$f":"CONCATENATE(\"Flat advance from \",LowRPM!L7,\" to \",Advance_curve!C7,\" RPM\")","v":"Flat advance from 76 to 673 RPM"},null,null,null,null,null,"cell I2 in tab \"lowRPM\""]
[]
["B)",{"$f":"CONCATENATE(\"Advance curve is freely adjustable from \",Advance_curve!C7,\" to \",Advance_curve!D9,\" RPM\")","v":"Advance curve is freely adjustable from 673 to 7812 RPM"},null,null,null,null,null,"cell B9 in tab \"Advance_curve\""]
[]
["C)",{"$f":"CONCATENATE(\"The \",Advance_curve!C7,\" RPM when the processor swap from [advance_curve] tab to the flat [advance_low_rpm] tab is adjustable by cell M42 in tab [Advance_curve]\")","v":"The 673 RPM when the processor swap from [advance_curve] tab to the flat [advance_low_rpm] tab is adjustable by cell M42 in tab [Advance_curve]"}]
[]
[null,"Eprom values to burn into the microcontroller",null,null,null,null,null,"cells O18 to 035 in tab \"Advance_curve\""]
[]
[null,{"$f":"CONCATENATE(\"No spark when engine goes above \",Advance_curve!D9,\"RPM - Act as absolute rev-limiter\")","v":"No spark when engine goes above 7812RPM - Act as absolute rev-limiter"},null,null,null,null,null,"cell B9 in tab \"Advance_curve\""]
{"$rows_left_out":5}
{"sheet":"Advance_curve","index":1,"n_rows":335,"n_cols":25,"rows_kept":335,"cut":false,"hidden":false,"merged":[]}
["27/03/2021",null,null,"Version 16F1827 v7.9r25c1",null,null,null,null,null,null,79,25,1]
[null,"Proc:","16F1827"]
[null,"Clock:",16,"MHz",null,"1 i",null,null,null,null,"Step"]
[null,"Fosc/4",{"$f":"C3/4","v":4},"MHz",null,"pickup position",null,"compute (us)",{"$f":"O28","v":26},null,"(us)"]
[null,"TMR1h max",{"$f":"MAX(B173:B335)","v":174},null,null,75,"degrees BTDC",null,null,null,40,{"$f":"IF(MAX(K9:K103)>254,\"Some warning. Increase STEP cell k5 ?\",\"\")","v":""}]
[null,"Frq min",{"$f":"MIN(C174:C335)","v":11.2248563218391},null,null,null,null,"hysteresis",{"$f":"O42*200","v":200}]
[null,"RPM min",{"$f":"MIN(D175:D335)","v":673},null,null,"4 i",null,null,null,null,{"$f":"IF(ISERROR(K9),\"Load DECHEX macro\",\"\")","v":""}]
[null,"TIMER1H count","Frq\n(Hz)","RPM","time for 1° (µs)","Advance (degrees)","Delay\nneeded\n(ms)","Delay\nnedeed\n(µs)","Delay\nto wait\n(µs)","@\nmap","Values for\nthe map"]
["3 g",15,{"$f":"IFERROR(1000000/(B9*256*($N$30/$C$4)),\"\")","v":130.208333333333},{"$f":"INT(60*C9*$N$25/2*$N$24)","v":7812},{"$f":"((1000*1000*60)/($N$24*D9))/360","v":21.3346987540536},30,{"$f":"(E9*($F$5-F9))/1000","v":0.960061443932412},{"$f":"E9*($F$5-F9)","v":960.061443932412},{"$f":"IF($H9>$I$4+$I$6,INT($H9-$I$4-$I$6),\"out of range\")","v":734},0,{"$f":"IFERROR(IF($I9/$K$5>255,255,IF($I9>0.01,INT($I9/$K$5),1)),255)","v":18},{"$f":"IF($I9/$K$5>255,CONCATENATE(\"WARNING: Timing will be more then \",F9,\"°\"),\"\")","v":""},null,null,null,null,null,null,null,null,null,null,null,null,{"$f":"CONCATENATE(K9,\"         ;\",ROUND(D9,0),\"rpm | \",ROUND(F9,1),\"° | \",,ROUND(G9,2),\"ms \")","v":"18         ;7812rpm | 30° | 0.96ms "}]
[{"$f":"IF($B10>255,CONCATENATE(\"ERROR: Timer1H too large\"),\"\")","v":""},{"$f":"IF((B9+1)<(N$44+$B$9),B9+1,\"- End -\")","v":16},{"$f":"IFERROR(1000000/(B10*256*($N$30/$C$4)),\"\")","v":122.0703125},{"$f":"INT(60*C10*$N$25/2*$N$24)","v":7324},22.7562352084471,30,1.02403058438012,1024.03058438012,{"$f":"IF($H10>$I$4+$I$6,INT($H10-$I$4-$I$6),\"out of range\")","v":798},1,19,"",null,null,null,null,null,null,null,null,null,null,null,null,"19         ;7324rpm | 30° | 1.02ms "]
["",17,114.889705882353,{"$f":"INT(60*C11*$N$25/2*$N$24)","v":6893},24.1791189129068,30,1.08806035108081,1088.06035108081,{"$f":"IF($H11>$I$4+$I$6,INT($H11-$I$4-$I$6),\"out of range\")","v":862},2,21,"",null,null,null,null,null,null,null,null,null,null,null,null,"21         ;6893rpm | 30° | 1.09ms "]
["",18,108.506944444444,6510,25.6016385048643,30,1.15207373271889,1152.07373271889,926,3,23,"",null,null,null,null,null,null,null,null,null,null,null,null,"23         ;6510rpm | 30° | 1.15ms "]
["",19,102.796052631579,6167,27.0255661856116,30,1.21615047835252,1216.15047835252,990,4,24,"",null,null,null,null,null,null,null,null,null,null,null,null,"24         ;6167rpm | 30° | 1.22ms "]
["",20,97.65625,5859,28.4462650054048,30,1.28008192524322,1280.08192524322,1054,5,26,"",null,null,null,null,null,null,null,null,null,null,null,null,"26         ;5859rpm | 30° | 1.28ms "]
["",21,93.0059523809524,5580,29.868578255675,29.9,1.34707287933094,1347.07287933094,1121,6,28,"",null,null,null,null,null,null,null,null,null,null,null,null,"28         ;5580rpm | 29.9° | 1.35ms "]
{"$rows_left_out":321}
{"sheet":"LowRPM","index":2,"n_rows":36,"n_cols":26,"rows_kept":36,"cut":false,"hidden":false,"merged":[[0,6,0,7]]}
[]
[null,"Advance at low RPM",null,{"$f":"CONCATENATE(\"from \",L7,\" to\")","v":"from 76 to"},{"$f":"CONCATENATE(ROUNDDOWN(Advance_curve!C7,0),\" RPM\")","v":"673 RPM"},null,null,"VLRPM",92,"us"]
[]
[null,null,null,"Cylinder(s) =",{"$f":"Advance_curve!N24","v":1},null,null,"Fosc/4",{"$f":"Advance_curve!C4","v":4},"MHz","TMR1deb max",{"$f":"48/I5","v":6}]
[null,null,null,"Strokes =",{"$f":"Advance_curve!N25","v":2},"STK",null,"Prescaler",{"$f":"Advance_curve!N30","v":8},null,"durée debords max",{"$f":"L4*I7","v":780.3},"ms"]
[null,null,null,"Pkp position =",{"$f":"Advance_curve!$F$5","v":75},"° BTDC",null,"periode TMR1L",{"$f":"I5/I4","v":2},"ms","Frq mini",{"$f":"1000/L5","v":1.28155837498398},"Hz","Frq",null,"periode","periode","1°","Timer1","TMR1h","TMR1deb","TMR1rest","Delay","Delay needed","Delay","advance"]
[null,null,null,"RPM limit =",{"$f":"IF(Advance_curve!N30=1,\"336\",IF(Advance_curve!N30=2,\"168\",IF(Advance_curve!N30=4,\"84\",IF(Advance_curve!N30=8,\"42\",\"False\"))))","v":"42"},"RPM",null,"débord TMR1H",{"$f":"255*255*I6/1000","v":130.05},"ms","RPM mini",{"$f":"INT(60*L6*E5/2*E4)","v":76},"RPM","Hz","RPM","µs","ms","us",null,null,null,null,"µs","µs","degres","degres BTDC"]
[null,null,null,null,null,null,null,null,null,null,null,null,null,1,{"$f":"IF(N8=\"End\",\" \",(N8*60*$E$5)/(2*$E$4))","v":60},{"$f":"1000000/N8","v":1000000},{"$f":"P8/1000","v":1000},{"$f":"((1000*1000*60)/($E$4*O8))/360","v":2777.77777777778},{"$f":"IF(N8=\"End\",\" \",INT(P8*Advance_curve!$C$4)/$I$5)","v":500000},{"$f":"IF(N8=\"End\",\" \",S8/255)","v":1960.78431372549},{"$f":"INT(T8/255)","v":7},{"$f":"T8-U8*255","v":175.78431372549},{"$f":"IF(U8<6,(U8*255*$I$2)+(V8*($I$2+0)),$I$2*(5*255+V8))","v":133472.156862745},{"$f":"W8","v":133472.156862745},{"$f":"X8/R8","v":48.0499764705882},{"$f":"$E$6-Y8","v":26.9500235294118}]
[null,null,null,null,null,null,null,"temps calcul",22,"µs",null,null,null,1.5,{"$f":"IF(N9=\"End\",\" \",(N9*60*$E$5)/(2*$E$4))","v":90},{"$f":"1000000/N9","v":666666.666666667},{"$f":"P9/1000","v":666.666666666667},{"$f":"((1000*1000*60)/($E$4*O9))/360","v":1851.85185185185},{"$f":"IF(N9=\"End\",\" \",INT(P9*Advance_curve!$C$4)/$I$5)","v":333333.25},{"$f":"IF(N9=\"End\",\" \",S9/255)","v":1307.18921568627},{"$f":"INT(T9/255)","v":5},{"$f":"T9-U9*255","v":32.1892156862746},120261.407843137,{"$f":"W9","v":120261.407843137},{"$f":"X9/R9","v":64.9411602352942},{"$f":"$E$6-Y9","v":10.0588397647058}]
[null,null,null,null,null,null,null,"hysteresis",{"$f":"Advance_curve!I6","v":200},"µs",null,null,null,{"$f":"IF(N8<Advance_curve!C$6,N8+1,\"End\")","v":2},120,500000,500,{"$f":"((1000*1000*60)/($E$4*O10))/360","v":1388.88888888889},{"$f":"IF(N10=\"End\",\" \",INT(P10*Advance_curve!$C$4)/$I$5)","v":250000},980.392156862745,{"$f":"INT(T10/255)","v":3},{"$f":"T10-U10*255","v":215.392156862745},90196.0784313725,90196.0784313725,{"$f":"X10/R10","v":64.9411764705882},{"$f":"$E$6-Y10","v":10.0588235294118}]
[null,null,null,null,null,null,null,null,null,null,null,null,null,{"$f":"IF(N10<Advance_curve!$C$6,N10+1,\"End\")","v":3},180,333333.333333333,333.333333333333,925.925925925926,{"$f":"IF(N11=\"End\",\" \",INT(P11*Advance_curve!$C$4)/$I$5)","v":166666.625},653.594607843137,2,143.594607843137,60130.7039215686,60130.7039215686,{"$f":"X11/R11","v":64.9411602352941},{"$f":"IF($U11<5,$E$6-Y11,\"0\")","v":10.0588397647059}]
[null,null,null,null,null,null,null,null,null,null,null,null,null,{"$f":"IF(N11<Advance_curve!$C$6,N11+1,\"End\")","v":4},240,250000,250,694.444444444444,{"$f":"IF(N12=\"End\",\" \",INT(P12*Advance_curve!$C$4)/$I$5)","v":125000},490.196078431373,1,235.196078431373,45098.0392156863,45098.0392156863,64.9411764705883,10.0588235294117]
[null,null,null,null,null,null,null,null,null,null,null,null,null,{"$f":"IF(N12<Advance_curve!$C$6,N12+1,\"End\")","v":5},300,200000,200,555.555555555556,{"$f":"IF(N13=\"End\",\" \",INT(P13*Advance_curve!$C$4)/$I$5)","v":100000},392.156862745098,1,137.156862745098,36078.431372549,36078.431372549,64.9411764705882,10.0588235294118]
[null,null,null,null,null,null,null,null,null,null,null,null,null,{"$f":"IF(N13<Advance_curve!$C$6,N13+1,\"End\")","v":6},360,166666.666666667,166.666666666667,462.962962962963,{"$f":"IF(N14=\"End\",\" \",INT(P14*Advance_curve!$C$4)/$I$5)","v":83333.25},326.797058823529,1,71.7970588235294,30065.3294117647,30065.3294117647,64.9411115294118,10.0588884705882]
[null,null,null,null,null,null,null,null,null,null,null,null,null,{"$f":"IF(N14<Advance_curve!$C$6,N14+1,\"End\")","v":7},420,142857.142857143,142.857142857143,396.825396825397,{"$f":"IF(N15=\"End\",\" \",INT(P15*Advance_curve!$C$4)/$I$5)","v":71428.5},280.111764705882,1,25.1117647058824,25770.2823529412,25770.2823529412,64.9411115294117,10.0588884705883]
{"$rows_left_out":22}
{"sheet":"EEPROM16","index":3,"n_rows":81,"n_cols":24,"rows_kept":81,"cut":false,"hidden":false,"merged":[]}
[null,null,null,null,null,null,null,null,null,null,null,null,null,null,"INTEL 16HEX format",null,"RAW format"]
[null,null,null,null,null,null,null,null,null,null,null,null,null,null,":020000040000FA",null,null,null,null,null,null,null,null,"Hash"]
["Bytes\n in Row","Address MSB (hex)","Address LSB (hex)","Address Start (MSB)","Address\nStart\n(LSB)","+0","+1","+2","+3","+4","+5","+6","+7",null,":020000040001F9",null,null,null,"sum[dec]","sum[hex]","LSB","two's\ncomplement [dec]","two's\ncomplement +1","cksum"]
[16,"E0",{"$f":"DEC2HEX(E4,2)","v":"00"},224,0,{"$f":"ROUND(Advance_curve!$K9,0)","v":18},{"$f":"ROUND(Advance_curve!$K10,0)","v":19},{"$f":"ROUND(Advance_curve!$K11,0)","v":21},{"$f":"ROUND(Advance_curve!$K12,0)","v":23},{"$f":"ROUND(Advance_curve!$K13,0)","v":24},{"$f":"ROUND(Advance_curve!$K14,0)","v":26},{"$f":"ROUND(Advance_curve!$K15,0)","v":28},{"$f":"ROUND(Advance_curve!$K16,0)","v":29},null,{"$f":"\":\"&DEC2HEX(A4,2)&B4&C4&\"00\"&DEC2HEX(F4,2)&\"00\"&DEC2HEX(G4,2)&\"00\"&DEC2HEX(H4,2)&\"00\"&DEC2HEX(I4,2)&\"00\"&DEC2HEX(J4,2)&\"00\"&DEC2HEX(K4,2)&\"00\"&DEC2HEX(L4,2)&\"00\"&DEC2HEX(M4,2)&\"00\"&X4","v":":10E00000120013001500170018001A001C001D0054"},null,{"$f":"DEC2HEX(F4,2)&\" \"&DEC2HEX(G4,2)&\" \"&DEC2HEX(H4,2)&\" \"&DEC2HEX(I4,2)&\"   \"&DEC2HEX(J4,2)&\" \"&DEC2HEX(K4,2)&\" \"&DEC2HEX(L4,2)&\" \"&DEC2HEX(M4,2)","v":"12 13 15 17   18 1A 1C 1D"},null,{"$f":"SUM(A4,D4:M4)","v":428},{"$f":"DEC2HEX(S4)","v":"1AC"},{"$f":"RIGHT(T4,2)","v":"AC"},{"$f":"255-HEX2DEC(U4)","v":83},{"$f":"V4+1","v":84},{"$f":"IF(W4=256,\"00\",DEC2HEX(W4,2))","v":"54"}]
[16,"E0","10",224,16,{"$f":"ROUND(Advance_curve!$K17,0)","v":31},{"$f":"ROUND(Advance_curve!$K18,0)","v":33},{"$f":"ROUND(Advance_curve!$K19,0)","v":34},{"$f":"ROUND(Advance_curve!$K20,0)","v":36},{"$f":"ROUND(Advance_curve!$K21,0)","v":38},{"$f":"ROUND(Advance_curve!$K22,0)","v":40},{"$f":"ROUND(Advance_curve!$K23,0)","v":42},{"$f":"ROUND(Advance_curve!K24,0)","v":44},null,":10E010001F00210022002400260028002A002C00D6",null,"1F 21 22 24   26 28 2A 2C",null,554,"22A","2A",213,214,"D6"]
[16,"E0","20",224,32,{"$f":"ROUND(Advance_curve!$K25,0)","v":46},{"$f":"ROUND(Advance_curve!$K26,0)","v":48},{"$f":"ROUND(Advance_curve!$K27,0)","v":50},{"$f":"ROUND(Advance_curve!$K28,0)","v":52},{"$f":"ROUND(Advance_curve!$K29,0)","v":55},{"$f":"ROUND(Advance_curve!$K30,0)","v":58},{"$f":"ROUND(Advance_curve!$K31,0)","v":61},{"$f":"ROUND(Advance_curve!$K32,0)","v":64},null,":10E020002E0030003200340037003A003D0040003E",null,"2E 30 32 34   37 3A 3D 40",null,706,"2C2","C2",61,62,"3E"]
[16,"E0","30",224,48,{"$f":"ROUND(Advance_curve!$K33,0)","v":67},{"$f":"ROUND(Advance_curve!$K34,0)","v":70},{"$f":"ROUND(Advance_curve!$K35,0)","v":73},{"$f":"ROUND(Advance_curve!$K36,0)","v":76},{"$f":"ROUND(Advance_curve!$K37,0)","v":79},{"$f":"ROUND(Advance_curve!$K38,0)","v":82},{"$f":"ROUND(Advance_curve!$K39,0)","v":85},{"$f":"ROUND(Advance_curve!$K40,0)","v":88},null,":10E030004300460049004C004F0052005500580074",null,"43 46 49 4C   4F 52 55 58",null,908,"38C","8C",115,116,"74"]
[16,"E0","40",224,64,{"$f":"ROUND(Advance_curve!$K41,0)","v":91},{"$f":"ROUND(Advance_curve!$K42,0)","v":94},{"$f":"ROUND(Advance_curve!$K43,0)","v":97},{"$f":"ROUND(Advance_curve!$K44,0)","v":100},{"$f":"ROUND(Advance_curve!$K45,0)","v":103},{"$f":"ROUND(Advance_curve!$K46,0)","v":106},{"$f":"ROUND(Advance_curve!$K47,0)","v":108},{"$f":"ROUND(Advance_curve!$K48,0)","v":111},null,":10E040005B005E006100640067006A006C006F00A6",null,"5B 5E 61 64   67 6A 6C 6F",null,1114,"45A","5A",165,166,"A6"]
[16,"E0","50",224,80,{"$f":"ROUND(Advance_curve!$K49,0)","v":114},{"$f":"ROUND(Advance_curve!$K50,0)","v":117},{"$f":"ROUND(Advance_curve!$K51,0)","v":119},{"$f":"ROUND(Advance_curve!$K52,0)","v":122},{"$f":"ROUND(Advance_curve!$K53,0)","v":125},{"$f":"ROUND(Advance_curve!$K54,0)","v":127},{"$f":"ROUND(Advance_curve!$K55,0)","v":130},{"$f":"ROUND(Advance_curve!$K56,0)","v":133},null,":10E050007200750077007A007D007F0082008500E5",null,"72 75 77 7A   7D 7F 82 85",null,1307,"51B","1B",228,229,"E5"]
[16,"E0","60",224,96,{"$f":"ROUND(Advance_curve!$K57,0)","v":135},{"$f":"ROUND(Advance_curve!$K58,0)","v":138},{"$f":"ROUND(Advance_curve!$K59,0)","v":141},{"$f":"ROUND(Advance_curve!$K60,0)","v":143},{"$f":"ROUND(Advance_curve!$K61,0)","v":146},{"$f":"ROUND(Advance_curve!$K62,0)","v":148},{"$f":"ROUND(Advance_curve!$K63,0)","v":151},{"$f":"ROUND(Advance_curve!$K64,0)","v":154},null,":10E0600087008A008D008F009200940097009A002C",null,"87 8A 8D 8F   92 94 97 9A",null,1492,"5D4","D4",43,44,"2C"]
[16,"E0","70",224,112,{"$f":"ROUND(Advance_curve!$K65,0)","v":156},{"$f":"ROUND(Advance_curve!$K66,0)","v":159},{"$f":"ROUND(Advance_curve!$K67,0)","v":161},{"$f":"ROUND(Advance_curve!$K68,0)","v":164},{"$f":"ROUND(Advance_curve!$K69,0)","v":166},{"$f":"ROUND(Advance_curve!$K70,0)","v":169},{"$f":"ROUND(Advance_curve!$K71,0)","v":171},{"$f":"ROUND(Advance_curve!$K72,0)","v":174},null,":10E070009C009F00A100A400A600A900AB00AE0078",null,"9C 9F A1 A4   A6 A9 AB AE",null,1672,"688","88",119,120,"78"]
[16,"E0","80",224,128,{"$f":"ROUND(Advance_curve!$K73,0)","v":176},{"$f":"ROUND(Advance_curve!$K74,0)","v":179},{"$f":"ROUND(Advance_curve!$K75,0)","v":181},{"$f":"ROUND(Advance_curve!$K76,0)","v":183},{"$f":"ROUND(Advance_curve!$K77,0)","v":186},{"$f":"ROUND(Advance_curve!$K78,0)","v":188},{"$f":"ROUND(Advance_curve!$K79,0)","v":190},{"$f":"ROUND(Advance_curve!$K80,0)","v":193},null,":10E08000B000B300B500B700BA00BC00BE00C100CC",null,"B0 B3 B5 B7   BA BC BE C1",null,1844,"734","34",203,204,"CC"]
[16,"E0","90",224,144,{"$f":"ROUND(Advance_curve!$K81,0)","v":195},{"$f":"ROUND(Advance_curve!$K82,0)","v":197},{"$f":"ROUND(Advance_curve!$K83,0)","v":200},{"$f":"ROUND(Advance_curve!$K84,0)","v":202},{"$f":"ROUND(Advance_curve!$K85,0)","v":204},{"$f":"ROUND(Advance_curve!$K86,0)","v":207},{"$f":"ROUND(Advance_curve!$K87,0)","v":209},{"$f":"ROUND(Advance_curve!$K88,0)","v":211},null,":10E09000C300C500C800CA00CC00CF00D100D30027",null,"C3 C5 C8 CA   CC CF D1 D3",null,2009,"7D9","D9",38,39,"27"]
[16,"E0","A0",224,160,{"$f":"ROUND(Advance_curve!$K89,0)","v":85},{"$f":"ROUND(Advance_curve!$K90,0)","v":86},{"$f":"ROUND(Advance_curve!$K91,0)","v":87},{"$f":"ROUND(Advance_curve!$K92,0)","v":88},{"$f":"ROUND(Advance_curve!$K93,0)","v":89},{"$f":"ROUND(Advance_curve!$K94,0)","v":90},{"$f":"ROUND(Advance_curve!$K95,0)","v":91},{"$f":"ROUND(Advance_curve!$K96,0)","v":92},null,":10E0A000550056005700580059005A005B005C00AC",null,"55 56 57 58   59 5A 5B 5C",null,1108,"454","54",171,172,"AC"]
[16,"E0","B0",224,176,{"$f":"ROUND(Advance_curve!K97,0)","v":93},{"$f":"ROUND(Advance_curve!K98,0)","v":93},{"$f":"ROUND(Advance_curve!K99,0)","v":94},{"$f":"ROUND(Advance_curve!K100,0)","v":95},{"$f":"ROUND(Advance_curve!K101,0)","v":96},{"$f":"ROUND(Advance_curve!K102,0)","v":97},{"$f":"ROUND(Advance_curve!K103,0)","v":98},{"$f":"ROUND(Advance_curve!K104,0)","v":99},null,":10E0B0005D005D005E005F00600061006200630063",null,"5D 5D 5E 5F   60 61 62 63",null,1181,"49D","9D",98,99,"63"]
{"$rows_left_out":67}
{"sheet":"Accuracy","index":4,"n_rows":16,"n_cols":3,"rows_kept":16,"cut":false,"hidden":false,"merged":[]}
["CYLINDRE:",1,"cyl"]
["STROKES",2,"stk"]
["ACCURACY",3.4,"us"]
[]
["RPM","ERROR"]
[0,0]
[1000,{"$f":"$B$3/((1000*(60*$B$2)/(2*$B$1*$A7))/0.36)","v":0.0204}]
[2000,0.0408]
[3000,0.0612]
[4000,0.0816]
[5000,0.102]
[6000,0.1224]
[7000,0.1428]
[8000,0.1632]
[9000,0.1836]
{"$rows_left_out":2}
{"sheet":"formules","index":5,"n_rows":66,"n_cols":25,"rows_kept":66,"cut":false,"hidden":false,"merged":[[0,10,0,11],[16,10,16,11],[16,13,16,14],[16,15,16,16],[17,15,17,16],[63,4,63,7],[63,8,63,11],[64,4,64,7],[64,8,64,11],[65,4,65,11]]}
[null,null,null,null,"TEMPS","CYLINDRE","RPM","FREQUENCE","PERIODE","PERIODE","1°",null,"durée =","degrés","relatif\npickup"]
[null,null,null,null,"Nbr","Nbr","tr/mn","Hz","ms","pour 2cyl 2tps","ms","us","us",null,{"$f":"Advance_curve!F5","v":75},null,null,null,null,null,null,null,"4 stk:"]
[null,null,null,null,2,1,5000,{"$f":"(2*$F$3*$G$3)/(60*$E$3)","v":83.3333333333333},{"$f":"1000*(60*$E$3)/(2*$F$3*$G$3)","v":12},{"$f":"1000*60/$G$3","v":12},{"$f":"I3/360","v":0.0333333333333333},{"$f":"I3/0.36","v":33.3333333333333},64000,{"$f":"M3/L3","v":1920},{"$f":"Advance_curve!F5-N3","v":-1845},null,null,null,null,null,null,null,"1 cyl","1/2 spark every rotation","720°"]
[null,null,null,null,null,null,null,null,{"$f":"1000*I3","v":12000},null,null,null,null,null,null,null,null,null,null,null,null,null,"2 cyl","1 spark every rotation","360°"]
[null,null,null,null,null,null,{"$f":"(60*$H$5*$E$3)/(2*$F$3)","v":120},2,{"$f":"1000*(60*$E$3)/(2*$F$3*$G$5)","v":500},{"$f":"1000*60/$G$5","v":500},{"$f":"I5/360","v":1.38888888888889},{"$f":"I5/0.36","v":1388.88888888889},null,"FRQ = (2*CYL*RPM) / (60*TEMPS)",null,null,null,null,null,null,null,null,"3 cyl","1,5 spark every rotation","240°"]
[null,null,null,null,null,null,null,null,null,null,null,null,null,"RPM = (60*FRQ*TEMPS) / ( 2*CYL)",null,null,null,null,null,null,null,null,"4 cyl","2 sparks every rotation","180°"]
[null,null,null,null,null,null,"Délai","=>","Délai","Avance",null,null,null,"1degré = (1000*1000*60*CYL) / ( 2*TEMPS*RPM)/360",null,null,null,null,null,null,null,null,"5 cyl","2,5 sparks every rotation","144°"]
[null,null,null,null,null,null,"us",null,"°","°",null,null,null,"RPM= 60*1000000/ TMR1*256*presc/Fosc",null,null,null,null,null,null,null,null,"6 cyl","3 sparks every rotation","120°"]
[null,null,null,null,null,null,9600,null,{"$f":"G9/L3","v":288},{"$f":"Advance_curve!F5-I9","v":-213},null,null,null,"TMR1=(PER*Fosc)/ presc*255",null,null,null,null,null,null,null,null,"10 cyl","5 sparks every rotation","72°"]
[null,null,null,null,null,null,null,null,null,null,null,null,null,"FRQ = 1/TMR1H = 1/TMR1H * (255 * PRES/Fosc) = 1*1000000 / TMR1H* (255 * PRES/Fosc) ",null,null,null,null,null,null,null,null,"12 cyl","6 sparks every rotation","60°"]
[2.5,null,null,null,null,null,"Frequence","=>","RPM","PERIODE"]
[null,null,null,null,null,null,100,"Hz",{"$f":"60*G12*$E$3/2*$F$3","v":6000},{"$f":"1000/G12","v":10},"ms"]
[]
[null,null,null,null,null,null,"Periode","=>","RPM","FRQ",null,null,null,null,null,null,null,null,"2 stk = 1 sprk per rev."]
[null,null,null,null,null,null,2,"ms",{"$f":"60*(1000/G15)*$E$3/(2*$F$3)","v":30000},{"$f":"1000/G15","v":500},"Hz",null,null,null,null,null,null,null,"4 stk = 1 sprk per 2 rev."]
{"$rows_left_out":52}
{"sheet":"Calculs","index":6,"n_rows":39,"n_cols":6,"rows_kept":39,"cut":false,"hidden":false,"merged":[]}
[]
["- Tant que pickup est bas (=0) 99% du temps, on met la valeur du TIMER0 dans la variable PERL (PERiode Low)"]
["- Chaque fois que TIMER0 provoque une INTerruption de debordement lorsqu'il arrive a 255,  dans la routine d'interruption on incremente TMR0H (TIMER0 High)"]
["- Quand le pickup est haut (=1) (pulse) :"]
["- on memorise la valeur de TMR0H (Nbr de debordements de TIMER0), dans PERH (PERiode High)"]
["- et on memorise aussi la valeur du TIMER0 dans la variable PERL."]
["- puis on RAZ les timers,"]
[]
["- Ainsi la durée ecoulé entre 2 pickups est stockée dans PERL et PERH.   Soit : (PERH x 255 ) + PERL"]
[]
["Avec Q=4MHz, Prescaler = 256 et Preset = 0"]
["TIMER0 s'incremente toutes les 256us et deborde toutes les 256x256= 65536us = 65,5ms = 15,25Hz"]
["(utiliser: E:\\Pic\\Exemples\\pic_calculations.xls)"]
["- donc [ (PERH * 255 ) + PERL ] * 65,5ms = durée entre 2 pulses."]
[]
{"$rows_left_out":25}
{"sheet":"Dwell variable","index":7,"n_rows":98,"n_cols":5,"rows_kept":98,"cut":false,"hidden":false,"merged":[]}
[]
[null,null,null,"coef:","DWELL = PERIODE * 50"]
[null,{"$f":"Advance_curve!B8","v":"TIMER1H count"},null,50]
[null,{"$f":"Advance_curve!B9","v":15},{"$f":"$D$3*Advance_curve!B9","v":750},"µs"]
[null,{"$f":"Advance_curve!B10","v":16},{"$f":"$D$3*Advance_curve!B10","v":800}]
[null,{"$f":"Advance_curve!B11","v":17},{"$f":"$D$3*Advance_curve!B11","v":850}]
[null,{"$f":"Advance_curve!B12","v":18},{"$f":"$D$3*Advance_curve!B12","v":900}]
[null,{"$f":"Advance_curve!B13","v":19},{"$f":"$D$3*Advance_curve!B13","v":950}]
[null,{"$f":"Advance_curve!B14","v":20},{"$f":"$D$3*Advance_curve!B14","v":1000}]
[null,{"$f":"Advance_curve!B15","v":21},{"$f":"$D$3*Advance_curve!B15","v":1050}]
[null,{"$f":"Advance_curve!B16","v":22},{"$f":"$D$3*Advance_curve!B16","v":1100}]
[null,{"$f":"Advance_curve!B17","v":23},{"$f":"$D$3*Advance_curve!B17","v":1150}]
[null,{"$f":"Advance_curve!B18","v":24},{"$f":"$D$3*Advance_curve!B18","v":1200}]
[null,{"$f":"Advance_curve!B19","v":25},{"$f":"$D$3*Advance_curve!B19","v":1250}]
[null,{"$f":"Advance_curve!B20","v":26},{"$f":"$D$3*Advance_curve!B20","v":1300}]
{"$rows_left_out":84}
{"sheet":"Version","index":8,"n_rows":73,"n_cols":12,"rows_kept":73,"cut":false,"hidden":false,"merged":[]}
[]
["v7.9r13c2","[HARD] Correction RA1 forcé a 1, car pullup R5 sur PCB"]
["v7.9r13c3","[XLS] Valeur de dwell passe de 2 choix (500,1000) a 6 choix (500,1000,2000,3000,4000,5000)."]
["v7.9r14c0","[SOFT,XLS] Ajout d'une valeur de dwell \"AUTO\" pour lequel la durée de dwell est proportionnelle a PERIODE."]
["v7.9r14c1","[SOFT] Code protection OFF"]
["v7.9r15c0","[XLS] La valeur d'avance affichée dans l'onglet \"advance_at_lowRPM\" ne prenait pas en compte la position du pickup, c'était donc une valeur RELATIVE, pas ABSOLUE. Multiplicateur peut descendre a 1 (soft OK)"]
[null,"[SOFT] si JP2 a la masse alors PIC bypass la courbe d'avance et envoi spark dés que detection front descendant du pickup"]
[null,"[SOFT] RB3 (ex TP2) n'était pas forcé en OUTPUT"]
[null,"[HARD] Suppression TP2 inutile"]
[null,"[HARD] Reduction R7 de 330 a 180 (Sinon ne declenche pas les SCR de type BTA)."]
[null,"[HARD] Suppression C9-100n car courant d'appel dépasse Imax du PIC"]
["v7.9r16c0","[XLS] La valeur d'avance affichée dans l'onglet \"advance_at_lowRPM\" était fausse."]
[null,"[SOFT] boucles d'attente pkp haut et bas en ASM: Precision x10 !!"]
[null,"[XLS] Ajout documentation onglet README"]
["v7.9r16c1","[XLS] Tuning: a low RPM, le PIC attend 4us x PERIODE mais en vrai bcl dure plus de 4us, du coup il y a un offset de 5deg (20° affiché et 15° reels)\npour simplifier correction: la valeur delay (I1) passe de 4 a 4.4"]
{"$rows_left_out":59}
{"sheet":"Excel","index":9,"n_rows":10,"n_cols":3,"rows_kept":10,"cut":false,"hidden":false,"merged":[]}
[]
[]
["Conversion de valeurs: ",null,"=SI(I2=2;2;(SI(I2=3;3;(SI(I2=4;4;(SI(I2=5;5;(SI(I2=6;6)))))))))"]
[]
["Liste deroulante: ",null,"Donnees> Validite des donnees"]
[]
[]
["les graphes n'affichent pas la valeur #N/A  , utiliser #N/A pour faire disparaitre les points du graphe"]
[]
["Pour afficher les liens d'une cellule: selectionner la > Formule > Reperer les antécédents/dependants "]